Migrate to conda based CI

9 jobs for <span class="ref-name">condapackage</span> in 28 minutes and 6 seconds (queued for 25 minutes and 58 seconds)
Status Job ID Name Coverage
  Build
failed #116525
docker
build_linux_27

00:23:56

87.0%
failed #116526
docker
build_linux_36

00:23:19

88.0%
failed #116527
macosx
build_macosx_27

00:27:18

84.0%
passed #116528
macosx
build_macosx_36

00:28:05

88.0%
failed #115546
docker
build_linux_27

00:04:52

failed #115547
docker
build_linux_36

00:05:23

failed #115548
macosx
build_macosx_27

00:02:27

failed #115549
macosx
build_macosx_36

00:02:15

 
  Deploy
skipped #115550
deployer
deploy_beta
 
Name Stage Failure
failed
build_linux_27 Build There is an unknown failure, please try again
Recognition rate for score file /local/builds/bob/bob.measure/miniconda/conda-bld/bob.measure_1516374229578/_test_env_placehold_placehold_placehold_placehold_placehold_placehold_placehold_placehold_placehold_placehold_placehold_placehold_placehold_placehold_placehold_placehold_placehold/lib/python2.7/site-packages/bob/measure/data/scores-cmc-4col.txt is 76.00%
Recognition rate for score file /local/builds/bob/bob.measure/miniconda/conda-bld/bob.measure_1516374229578/_test_env_placehold_placehold_placehold_placehold_placehold_placehold_placehold_placehold_placehold_placehold_placehold_placehold_placehold_placehold_placehold_placehold_placehold/lib/python2.7/site-packages/bob/measure/data/scores-cmc-5col.txt is 76.00%
Recognition rate for score file /local/builds/bob/bob.measure/miniconda/conda-bld/bob.measure_1516374229578/_test_env_placehold_placehold_placehold_placehold_placehold_placehold_placehold_placehold_placehold_placehold_placehold_placehold_placehold_placehold_placehold_placehold_placehold/lib/python2.7/site-packages/bob/measure/data/scores-cmc-4col-open-set.txt is 77.78%
Tests failed for bob.measure-2.5.0b0-py27h218d36b_0.tar.bz2 - moving package to /local/builds/bob/bob.measure/miniconda/conda-bld/broken
WARNING:conda_build.build:Tests failed for bob.measure-2.5.0b0-py27h218d36b_0.tar.bz2 - moving package to /local/builds/bob/bob.measure/miniconda/conda-bld/broken
removing: bob.measure-2.5.0b0-py27h218d36b_0.tar.bz2
TESTS FAILED: bob.measure-2.5.0b0-py27h218d36b_0.tar.bz2
(15:24:31.723) Error: Command Failed "/local/builds/bob/bob.measure/miniconda/bin/conda build --no-anaconda-upload --variant-config-files _ci/conda_build_config.yaml --python=2.7 conda"
ERROR: Job failed: exit code 1
failed
build_linux_36 Build There is an unknown failure, please try again
Recognition rate for score file /local/builds/bob/bob.measure/miniconda/conda-bld/bob.measure_1516374234505/_test_env_placehold_placehold_placehold_placehold_placehold_placehold_placehold_placehold_placehold_placehold_placehold_placehold_placehold_placehold_placehold_placehold_placehold/lib/python3.6/site-packages/bob/measure/data/scores-cmc-4col.txt is 76.00%
Recognition rate for score file /local/builds/bob/bob.measure/miniconda/conda-bld/bob.measure_1516374234505/_test_env_placehold_placehold_placehold_placehold_placehold_placehold_placehold_placehold_placehold_placehold_placehold_placehold_placehold_placehold_placehold_placehold_placehold/lib/python3.6/site-packages/bob/measure/data/scores-cmc-5col.txt is 76.00%
Recognition rate for score file /local/builds/bob/bob.measure/miniconda/conda-bld/bob.measure_1516374234505/_test_env_placehold_placehold_placehold_placehold_placehold_placehold_placehold_placehold_placehold_placehold_placehold_placehold_placehold_placehold_placehold_placehold_placehold/lib/python3.6/site-packages/bob/measure/data/scores-cmc-4col-open-set.txt is 77.78%
Tests failed for bob.measure-2.5.0b0-py36h218d36b_0.tar.bz2 - moving package to /local/builds/bob/bob.measure/miniconda/conda-bld/broken
WARNING:conda_build.build:Tests failed for bob.measure-2.5.0b0-py36h218d36b_0.tar.bz2 - moving package to /local/builds/bob/bob.measure/miniconda/conda-bld/broken
removing: bob.measure-2.5.0b0-py36h218d36b_0.tar.bz2
TESTS FAILED: bob.measure-2.5.0b0-py36h218d36b_0.tar.bz2
(15:23:52.827) Error: Command Failed "/local/builds/bob/bob.measure/miniconda/bin/conda build --no-anaconda-upload --variant-config-files _ci/conda_build_config.yaml --python=3.6 conda"
ERROR: Job failed: exit code 1
failed
build_macosx_27 Build There is an unknown failure, please try again
  HTER | 6.090%          | 4.712%         
[Plots] Performance curves => '/var/folders/8n/phc2t7ln52l2srkgv49ybfj00001fc/T/bob.measure.test_scriptsTYgOUN.pdf'
Recognition rate for score file /Users/buildbot/work/gitlab-ci/f6f95b82/0/bob/bob.measure/miniconda/conda-bld/bob.measure_1516374741673/_test_env_placehold_placehold_placehold_placehold_placehold_placehold_placehold_placehold_placehold_placehold_placehold_placehold_placehold_placehold_p/lib/python2.7/site-packages/bob/measure/data/scores-cmc-4col.txt is 76.00%
Tests failed for bob.measure-2.5.0b0-py27hb1e1a42_0.tar.bz2 - moving package to /Users/buildbot/work/gitlab-ci/f6f95b82/0/bob/bob.measure/miniconda/conda-bld/broken
WARNING:conda_build.build:Tests failed for bob.measure-2.5.0b0-py27hb1e1a42_0.tar.bz2 - moving package to /Users/buildbot/work/gitlab-ci/f6f95b82/0/bob/bob.measure/miniconda/conda-bld/broken
removing: bob.measure-2.5.0b0-py27hb1e1a42_0.tar.bz2
TESTS FAILED: bob.measure-2.5.0b0-py27hb1e1a42_0.tar.bz2
(16:37:12.277) Error: Command Failed "/Users/buildbot/work/gitlab-ci/f6f95b82/0/bob/bob.measure/miniconda/bin/conda build --no-anaconda-upload --variant-config-files _ci/conda_build_config.yaml --python=2.7 conda"
ERROR: Job failed: exit status 1