Reformulating the Trainer

6 jobs for tf-slim in 11 minutes and 39 seconds (queued for 267 minutes and 51 seconds)
Status Job ID Name Coverage
  Build
passed #56816
conda-linux
build_linux_27

00:02:39

passed #56818
conda-linux
build_linux_34

00:02:27

passed #56817
conda-linux
build_linux_35

00:03:39

 
  Test
failed #56820
conda-linux
test_linux_27

00:02:52

failed #56819
conda-linux
test_linux_34

00:03:02

failed #56821
conda-linux
test_linux_35

00:03:29

 
Name Stage Failure
failed
test_linux_35 Test There is an unknown failure, please try again

----------------------------------------------------------------------
Ran 27 tests in 79.457s

FAILED (errors=21)
(05:28:20)
Error: Command Failed "/home/gitlab-runner/builds/0d638152/1/bob/bob.learn.tensorflow/build-prefix/bin/coverage run --source=bob.learn.tensorflow /home/gitlab-runner/builds/0d638152/1/bob/bob.learn.tensorflow/build-prefix/bin/nosetests -sv bob.learn.tensorflow"
Running after script...
$ ./_ci/after_test.sh
ERROR: Build failed: exit status 1
failed
test_linux_27 Test There is an unknown failure, please try again
----------------------------------------------------------------------
Ran 27 tests in 69.125s

FAILED (errors=21)
Exception AttributeError: "'NoneType' object has no attribute 'TF_DeleteStatus'" in <bound method Session.__del__ of <tensorflow.python.client.session.Session object at 0x7ff198149090>> ignored
(05:24:46)
Error: Command Failed "/home/gitlab-runner/builds/0d638152/1/bob/bob.learn.tensorflow/build-prefix/bin/coverage run --source=bob.learn.tensorflow /home/gitlab-runner/builds/0d638152/1/bob/bob.learn.tensorflow/build-prefix/bin/nosetests -sv bob.learn.tensorflow"
Running after script...
$ ./_ci/after_test.sh
ERROR: Build failed: exit status 1
failed
test_linux_34 Test There is an unknown failure, please try again

----------------------------------------------------------------------
Ran 27 tests in 76.362s

FAILED (errors=21)
(05:24:55)
Error: Command Failed "/home/gitlab-runner/builds/0d638152/0/bob/bob.learn.tensorflow/build-prefix/bin/coverage run --source=bob.learn.tensorflow /home/gitlab-runner/builds/0d638152/0/bob/bob.learn.tensorflow/build-prefix/bin/nosetests -sv bob.learn.tensorflow"
Running after script...
$ ./_ci/after_test.sh
ERROR: Build failed: exit status 1