Updated the cnn test

6 jobs for 23-tensorflow-1-0 in 5 minutes and 52 seconds (queued for 8 seconds)
Status Job ID Name Coverage
  Build
passed #52576
conda-linux
build_linux_27

00:03:15

passed #52578
conda-linux
build_linux_34

00:02:44

passed #52577
conda-linux
build_linux_35

00:03:28

 
  Test
failed #52580
conda-linux
test_linux_27

00:02:23

failed #52579
conda-linux
test_linux_34

00:02:10

failed #52581
conda-linux
test_linux_35

00:02:22

 
Name Stage Failure
failed
test_linux_35 Test There is an unknown failure, please try again

----------------------------------------------------------------------
Ran 27 tests in 53.082s

FAILED (errors=8)
(09:47:10)
Error: Command Failed "/home/gitlab-runner/builds/0d638152/2/bob/bob.learn.tensorflow/build-prefix/bin/coverage run --source=bob.learn.tensorflow /home/gitlab-runner/builds/0d638152/2/bob/bob.learn.tensorflow/build-prefix/bin/nosetests -sv bob.learn.tensorflow"
Running after script...
$ ./_ci/after_test.sh
ERROR: Build failed: exit status 1
failed
test_linux_27 Test There is an unknown failure, please try again
----------------------------------------------------------------------
Ran 27 tests in 60.576s

FAILED (errors=8)
Exception AttributeError: "'NoneType' object has no attribute 'raise_exception_on_not_ok_status'" in <bound method Session.__del__ of <tensorflow.python.client.session.Session object at 0x7f052db728d0>> ignored
(09:47:11)
Error: Command Failed "/home/gitlab-runner/builds/0d638152/1/bob/bob.learn.tensorflow/build-prefix/bin/coverage run --source=bob.learn.tensorflow /home/gitlab-runner/builds/0d638152/1/bob/bob.learn.tensorflow/build-prefix/bin/nosetests -sv bob.learn.tensorflow"
Running after script...
$ ./_ci/after_test.sh
ERROR: Build failed: exit status 1
failed
test_linux_34 Test There is an unknown failure, please try again

----------------------------------------------------------------------
Ran 27 tests in 43.851s

FAILED (errors=8)
(09:46:57)
Error: Command Failed "/home/gitlab-runner/builds/0d638152/0/bob/bob.learn.tensorflow/build-prefix/bin/coverage run --source=bob.learn.tensorflow /home/gitlab-runner/builds/0d638152/0/bob/bob.learn.tensorflow/build-prefix/bin/nosetests -sv bob.learn.tensorflow"
Running after script...
$ ./_ci/after_test.sh
ERROR: Build failed: exit status 1