Tensorflow 1.0

9 jobs for 23-tensorflow-1-0 in 5 minutes and 28 seconds (queued for 4 seconds)
Status Job ID Name Coverage
  Build
passed #51167
conda-linux
build_linux_27

00:01:22

passed #51169
conda-linux
build_linux_34

00:01:51

passed #51168
conda-linux
build_linux_35

00:01:49

failed #51142
conda-linux
build_linux_27

00:02:30

failed #51144
conda-linux
build_linux_34

00:02:32

failed #51143
conda-linux
build_linux_35

00:02:32

 
  Test
failed #51146
conda-linux
test_linux_27

00:02:04

failed #51145
conda-linux
test_linux_34

00:02:15

failed #51147
conda-linux
test_linux_35

00:02:10

 
Name Stage Failure
failed
test_linux_35 Test There is an unknown failure, please try again

----------------------------------------------------------------------
Ran 27 tests in 63.500s

FAILED (errors=8)
(12:11:24)
Error: Command Failed "/home/gitlab-runner/builds/0d638152/2/bob/bob.learn.tensorflow/build-prefix/bin/coverage run --source=bob.learn.tensorflow /home/gitlab-runner/builds/0d638152/2/bob/bob.learn.tensorflow/build-prefix/bin/nosetests -sv bob.learn.tensorflow"
Running after script...
$ ./_ci/after_test.sh
ERROR: Build failed: exit status 1
failed
test_linux_27 Test There is an unknown failure, please try again
----------------------------------------------------------------------
Ran 27 tests in 60.385s

FAILED (errors=8)
Exception AttributeError: "'NoneType' object has no attribute 'raise_exception_on_not_ok_status'" in <bound method Session.__del__ of <tensorflow.python.client.session.Session object at 0x7f23959f18d0>> ignored
(12:11:16)
Error: Command Failed "/home/gitlab-runner/builds/0d638152/1/bob/bob.learn.tensorflow/build-prefix/bin/coverage run --source=bob.learn.tensorflow /home/gitlab-runner/builds/0d638152/1/bob/bob.learn.tensorflow/build-prefix/bin/nosetests -sv bob.learn.tensorflow"
Running after script...
$ ./_ci/after_test.sh
ERROR: Build failed: exit status 1
failed
test_linux_34 Test There is an unknown failure, please try again

----------------------------------------------------------------------
Ran 27 tests in 67.948s

FAILED (errors=8)
(12:11:27)
Error: Command Failed "/home/gitlab-runner/builds/0d638152/0/bob/bob.learn.tensorflow/build-prefix/bin/coverage run --source=bob.learn.tensorflow /home/gitlab-runner/builds/0d638152/0/bob/bob.learn.tensorflow/build-prefix/bin/nosetests -sv bob.learn.tensorflow"
Running after script...
$ ./_ci/after_test.sh
ERROR: Build failed: exit status 1