Added option regulirize the weights

4 jobs for updates in 33 minutes and 30 seconds (queued for 3 seconds)
latest
Status Job ID Name Coverage
  Build
failed #214471
docker
build_linux_36

00:03:29

failed #214472
docker
build_linux_37

00:03:22

failed #214469
macosx
build_macosx_36

00:33:24

failed #214470
macosx
build_macosx_37

00:33:30

 
Name Stage Failure
failed
build_macosx_37 Build
WARNING conda_build.build:tests_failed(2896): Tests failed for bob.learn.tensorflow-1.2.1b0-py37h7d057f6_0.conda - moving package to /Users/gitlab/builds/b6d3167a/1/bob/bob.learn.tensorflow/miniconda/conda-bld/broken
TESTS FAILED: bob.learn.tensorflow-1.2.1b0-py37h7d057f6_0.conda
Uploading artifacts for failed job
Uploading artifacts...
Runtime platform
arch=amd64 os=darwin pid=23277 revision=ece86343 version=13.5.0
WARNING: coverage.xml: no matching files
ERROR: No files to upload
Cleaning up file based variables
ERROR: Job failed: exit status 1
failed
build_macosx_36 Build
WARNING conda_build.build:tests_failed(2896): Tests failed for bob.learn.tensorflow-1.2.1b0-py36h7d057f6_0.conda - moving package to /Users/gitlab/builds/b6d3167a/0/bob/bob.learn.tensorflow/miniconda/conda-bld/broken
TESTS FAILED: bob.learn.tensorflow-1.2.1b0-py36h7d057f6_0.conda
Uploading artifacts for failed job
Uploading artifacts...
Runtime platform
arch=amd64 os=darwin pid=23254 revision=ece86343 version=13.5.0
WARNING: coverage.xml: no matching files
ERROR: No files to upload
Cleaning up file based variables
ERROR: Job failed: exit status 1
failed
build_linux_36 Build
Tests failed for bob.learn.tensorflow-1.2.1b0-py36h189bdb7_0.conda - moving package to /scratch/builds/bob/bob.learn.tensorflow/miniconda/conda-bld/broken
WARNING conda_build.build:tests_failed(2896): Tests failed for bob.learn.tensorflow-1.2.1b0-py36h189bdb7_0.conda - moving package to /scratch/builds/bob/bob.learn.tensorflow/miniconda/conda-bld/broken
TESTS FAILED: bob.learn.tensorflow-1.2.1b0-py36h189bdb7_0.conda
Uploading artifacts for failed job
Uploading artifacts...
WARNING: coverage.xml: no matching files
ERROR: No files to upload
Cleaning up file based variables
ERROR: Job failed: exit code 1
failed
build_linux_37 Build
Tests failed for bob.learn.tensorflow-1.2.1b0-py37h189bdb7_0.conda - moving package to /scratch/builds/bob/bob.learn.tensorflow/miniconda/conda-bld/broken
WARNING conda_build.build:tests_failed(2896): Tests failed for bob.learn.tensorflow-1.2.1b0-py37h189bdb7_0.conda - moving package to /scratch/builds/bob/bob.learn.tensorflow/miniconda/conda-bld/broken
TESTS FAILED: bob.learn.tensorflow-1.2.1b0-py37h189bdb7_0.conda
Uploading artifacts for failed job
Uploading artifacts...
WARNING: coverage.xml: no matching files
ERROR: No files to upload
Cleaning up file based variables
ERROR: Job failed: exit code 1