adapted part of the code for saving tf databases as tfrecords and loading them...

adapted part of the code for saving tf databases as tfrecords and loading them from tf records to tf2
4 jobs for towards_tf2 in 8 minutes and 22 seconds (queued for 4 seconds)
latest
Status Job ID Name Coverage
  Build
failed #202964
docker
build_linux_36

00:08:20

40.0%
failed #202965
docker
build_linux_37

00:08:12

40.0%
failed #202962
macosx
build_macosx_36

00:08:03

40.0%
failed #202963
macosx
build_macosx_37

00:07:41

40.0%
 
Name Stage Failure
failed
build_linux_36 Build
FAILED (errors=1)
Tests failed for bob.learn.tensorflow-1.2.1b0-py36hdcd56f9_79.conda - moving package to /scratch/builds/bob/bob.learn.tensorflow/miniconda/conda-bld/broken
WARNING:conda_build.build:Tests failed for bob.learn.tensorflow-1.2.1b0-py36hdcd56f9_79.conda - moving package to /scratch/builds/bob/bob.learn.tensorflow/miniconda/conda-bld/broken
TESTS FAILED: bob.learn.tensorflow-1.2.1b0-py36hdcd56f9_79.conda
Uploading artifacts for failed job
Uploading artifacts...
WARNING: coverage.xml: no matching files
ERROR: No files to upload
ERROR: Job failed: exit code 1
failed
build_linux_37 Build
FAILED (errors=1)
Tests failed for bob.learn.tensorflow-1.2.1b0-py37hdcd56f9_77.conda - moving package to /scratch/builds/bob/bob.learn.tensorflow/miniconda/conda-bld/broken
WARNING:conda_build.build:Tests failed for bob.learn.tensorflow-1.2.1b0-py37hdcd56f9_77.conda - moving package to /scratch/builds/bob/bob.learn.tensorflow/miniconda/conda-bld/broken
TESTS FAILED: bob.learn.tensorflow-1.2.1b0-py37hdcd56f9_77.conda
Uploading artifacts for failed job
Uploading artifacts...
WARNING: coverage.xml: no matching files
ERROR: No files to upload
ERROR: Job failed: exit code 1
failed
build_macosx_36 Build
Tests failed for bob.learn.tensorflow-1.2.1b0-py36hdcd56f9_76.conda - moving package to /Users/gitlab/builds/b6d3167a/0/bob/bob.learn.tensorflow/miniconda/conda-bld/broken
WARNING:conda_build.build:Tests failed for bob.learn.tensorflow-1.2.1b0-py36hdcd56f9_76.conda - moving package to /Users/gitlab/builds/b6d3167a/0/bob/bob.learn.tensorflow/miniconda/conda-bld/broken
TESTS FAILED: bob.learn.tensorflow-1.2.1b0-py36hdcd56f9_76.conda
Uploading artifacts for failed job
Uploading artifacts...
Runtime platform
arch=amd64 os=darwin pid=9224 revision=6fbc7474 version=13.1.1
WARNING: coverage.xml: no matching files
ERROR: No files to upload
ERROR: Job failed: exit status 1
failed
build_macosx_37 Build
Tests failed for bob.learn.tensorflow-1.2.1b0-py37hdcd56f9_76.conda - moving package to /Users/gitlab/builds/b6d3167a/1/bob/bob.learn.tensorflow/miniconda/conda-bld/broken
WARNING:conda_build.build:Tests failed for bob.learn.tensorflow-1.2.1b0-py37hdcd56f9_76.conda - moving package to /Users/gitlab/builds/b6d3167a/1/bob/bob.learn.tensorflow/miniconda/conda-bld/broken
TESTS FAILED: bob.learn.tensorflow-1.2.1b0-py37hdcd56f9_76.conda
Uploading artifacts for failed job
Uploading artifacts...
Runtime platform
arch=amd64 os=darwin pid=9206 revision=6fbc7474 version=13.1.1
WARNING: coverage.xml: no matching files
ERROR: No files to upload
ERROR: Job failed: exit status 1