Add a Gaussian blur filter

4 jobs for new-changes in 264 minutes and 8 seconds (queued for 3 seconds)
Status Job ID Name Coverage
  Build
failed #186926
docker
build_linux_36

03:00:01

failed #186927
docker
build_linux_37

03:00:00

failed #186924
macosx
build_macosx_36

02:47:01

61.0%
failed #186925
macosx
build_macosx_37

02:46:11

61.0%
 
Name Stage Failure
failed
build_macosx_36 Build
TOTAL                                                     3559   1381    61%
----------------------------------------------------------------------
Ran 42 tests in 9568.484s

FAILED (failures=1)
Tests failed for bob.learn.tensorflow-1.1.2b0-py36hee48927_18.conda - moving package to /Users/gitlab/builds/b6d3167a/3/bob/bob.learn.tensorflow/miniconda/conda-bld/broken
WARNING:conda_build.build:Tests failed for bob.learn.tensorflow-1.1.2b0-py36hee48927_18.conda - moving package to /Users/gitlab/builds/b6d3167a/3/bob/bob.learn.tensorflow/miniconda/conda-bld/broken
TESTS FAILED: bob.learn.tensorflow-1.1.2b0-py36hee48927_18.conda
ERROR: Job failed: exit status 1
failed
build_macosx_37 Build
TOTAL                                                     3559   1381    61%
----------------------------------------------------------------------
Ran 42 tests in 9539.643s

FAILED (failures=1)
Tests failed for bob.learn.tensorflow-1.1.2b0-py37hee48927_17.conda - moving package to /Users/gitlab/builds/b6d3167a/2/bob/bob.learn.tensorflow/miniconda/conda-bld/broken
WARNING:conda_build.build:Tests failed for bob.learn.tensorflow-1.1.2b0-py37hee48927_17.conda - moving package to /Users/gitlab/builds/b6d3167a/2/bob/bob.learn.tensorflow/miniconda/conda-bld/broken
TESTS FAILED: bob.learn.tensorflow-1.1.2b0-py37hee48927_17.conda
ERROR: Job failed: exit status 1
failed
build_linux_36 Build The script exceeded the maximum execution time set for the job
OMP: Info #250: KMP_AFFINITY: pid 3005 tid 8942 thread 3 bound to OS proc set 3
OMP: Info #250: KMP_AFFINITY: pid 3005 tid 9266 thread 4 bound to OS proc set 4
bob.learn.tensorflow.utils.hooks@2020-02-07 18:04:08,239 -- INFO: accuracy/value:0 is currently at 0.859678 (at step of 191788) and the best value was -inf (at step of 0)
OMP: Info #250: KMP_AFFINITY: pid 3005 tid 9267 thread 5 bound to OS proc set 5
OMP: Info #250: KMP_AFFINITY: pid 3005 tid 9589 thread 4 bound to OS proc set 4
bob.learn.tensorflow.utils.hooks@2020-02-07 18:14:07,539 -- INFO: accuracy/value:0 is currently at 0.860612 (at step of 378926) and the best value was 0.859678 (at step of 191788)
OMP: Info #250: KMP_AFFINITY: pid 3005 tid 9590 thread 5 bound to OS proc set 5
Pulling docker image gitlab/gitlab-runner-helper:x86_64-003fe500 ...
ERROR: Job failed: execution took longer than 3h0m0s seconds
failed
build_linux_37 Build The script exceeded the maximum execution time set for the job
OMP: Info #250: KMP_AFFINITY: pid 2874 tid 8743 thread 3 bound to OS proc set 3
OMP: Info #250: KMP_AFFINITY: pid 2874 tid 9067 thread 4 bound to OS proc set 4
bob.learn.tensorflow.utils.hooks@2020-02-07 18:01:45,819 -- INFO: accuracy/value:0 is currently at 0.841740 (at step of 200227) and the best value was -inf (at step of 0)
OMP: Info #250: KMP_AFFINITY: pid 2874 tid 9068 thread 4 bound to OS proc set 4
OMP: Info #250: KMP_AFFINITY: pid 2874 tid 9391 thread 4 bound to OS proc set 4
bob.learn.tensorflow.utils.hooks@2020-02-07 18:11:45,856 -- INFO: accuracy/value:0 is currently at 0.805871 (at step of 400640) and the best value was 0.841740 (at step of 200227)
OMP: Info #250: KMP_AFFINITY: pid 2874 tid 9392 thread 5 bound to OS proc set 5
Pulling docker image gitlab/gitlab-runner-helper:x86_64-003fe500 ...
ERROR: Job failed: execution took longer than 3h0m0s seconds