[extractor] added DeepPixBiSExtractor in __init__.py

6 jobs for deeppixbis-extractor in 13 minutes and 55 seconds (queued for 3 seconds)
Status Job ID Name Coverage
  Build
failed #182157
docker
build_linux_36

00:10:24

71.0%
failed #182158
docker
build_linux_37

00:10:05

71.0%
passed #178353
macosx
build_macosx_36

00:03:31

passed #178354
macosx
build_macosx_37

00:03:21

failed #178355
docker
build_linux_36

00:04:00

failed #178356
docker
build_linux_37

00:06:29

 
Name Stage Failure
failed
build_linux_36 Build
TOTAL                                                  2484    721    71%
----------------------------------------------------------------------
Ran 14 tests in 345.950s

FAILED (errors=1)
Tests failed for bob.learn.pytorch-0.0.5b0-py36hb5cf52c_0.conda - moving package to /scratch/builds/bob/bob.learn.pytorch/miniconda/conda-bld/broken
WARNING:conda_build.build:Tests failed for bob.learn.pytorch-0.0.5b0-py36hb5cf52c_0.conda - moving package to /scratch/builds/bob/bob.learn.pytorch/miniconda/conda-bld/broken
TESTS FAILED: bob.learn.pytorch-0.0.5b0-py36hb5cf52c_0.conda
ERROR: Job failed: exit code 1
failed
build_linux_37 Build
TOTAL                                                  2484    721    71%
----------------------------------------------------------------------
Ran 14 tests in 331.259s

FAILED (errors=1)
Tests failed for bob.learn.pytorch-0.0.5b0-py37hb5cf52c_0.conda - moving package to /scratch/builds/bob/bob.learn.pytorch/miniconda/conda-bld/broken
WARNING:conda_build.build:Tests failed for bob.learn.pytorch-0.0.5b0-py37hb5cf52c_0.conda - moving package to /scratch/builds/bob/bob.learn.pytorch/miniconda/conda-bld/broken
TESTS FAILED: bob.learn.pytorch-0.0.5b0-py37hb5cf52c_0.conda
ERROR: Job failed: exit code 1