[test_trainer] Relax test constraints on closeness (new libsvm 3.24)

4 jobs for fix-floating-point-cmp in 10 minutes and 13 seconds (queued for 1 second)
Status Job ID Name Coverage
  Build
failed #183769
docker
build_linux_36

00:03:07

failed #183770
docker
build_linux_37

00:03:08

failed #183767
macosx
build_macosx_36

00:10:12

failed #183768
macosx
build_macosx_37

00:10:11

 
Name Stage Failure
failed
build_macosx_36 Build
bob/learn/libsvm/__init__.py      10      1    90%
----------------------------------------------------------------------
Ran 19 tests in 0.221s

FAILED (failures=1)
Tests failed for bob.learn.libsvm-2.1.4b0-py36h2432bb8_46.conda - moving package to /Users/gitlab/builds/f6f95b82/0/bob/bob.learn.libsvm/miniconda/conda-bld/broken
WARNING:conda_build.build:Tests failed for bob.learn.libsvm-2.1.4b0-py36h2432bb8_46.conda - moving package to /Users/gitlab/builds/f6f95b82/0/bob/bob.learn.libsvm/miniconda/conda-bld/broken
TESTS FAILED: bob.learn.libsvm-2.1.4b0-py36h2432bb8_46.conda
ERROR: Job failed: exit status 1
failed
build_macosx_37 Build
bob/learn/libsvm/__init__.py      10      1    90%
----------------------------------------------------------------------
Ran 19 tests in 0.200s

FAILED (failures=1)
Tests failed for bob.learn.libsvm-2.1.4b0-py37h2432bb8_46.conda - moving package to /Users/gitlab/builds/f6f95b82/1/bob/bob.learn.libsvm/miniconda/conda-bld/broken
WARNING:conda_build.build:Tests failed for bob.learn.libsvm-2.1.4b0-py37h2432bb8_46.conda - moving package to /Users/gitlab/builds/f6f95b82/1/bob/bob.learn.libsvm/miniconda/conda-bld/broken
TESTS FAILED: bob.learn.libsvm-2.1.4b0-py37h2432bb8_46.conda
ERROR: Job failed: exit status 1
failed
build_linux_37 Build
bob/learn/libsvm/__init__.py      10      1    90%
----------------------------------------------------------------------
Ran 19 tests in 0.146s

FAILED (failures=1)
Tests failed for bob.learn.libsvm-2.1.4b0-py37h37dd6c6_43.conda - moving package to /scratch/builds/bob/bob.learn.libsvm/miniconda/conda-bld/broken
WARNING:conda_build.build:Tests failed for bob.learn.libsvm-2.1.4b0-py37h37dd6c6_43.conda - moving package to /scratch/builds/bob/bob.learn.libsvm/miniconda/conda-bld/broken
TESTS FAILED: bob.learn.libsvm-2.1.4b0-py37h37dd6c6_43.conda
ERROR: Job failed: exit code 1
failed
build_linux_36 Build
bob/learn/libsvm/__init__.py      10      1    90%
----------------------------------------------------------------------
Ran 19 tests in 0.163s

FAILED (failures=1)
Tests failed for bob.learn.libsvm-2.1.4b0-py36h37dd6c6_47.conda - moving package to /scratch/builds/bob/bob.learn.libsvm/miniconda/conda-bld/broken
WARNING:conda_build.build:Tests failed for bob.learn.libsvm-2.1.4b0-py36h37dd6c6_47.conda - moving package to /scratch/builds/bob/bob.learn.libsvm/miniconda/conda-bld/broken
TESTS FAILED: bob.learn.libsvm-2.1.4b0-py36h37dd6c6_47.conda
ERROR: Job failed: exit code 1