[test_trainer] Be more verbose when test fails

4 jobs for fix-floating-point-cmp in 3 minutes and 13 seconds (queued for 5 seconds)
Status Job ID Name Coverage
  Build
failed #183765
docker
build_linux_36

00:03:07

failed #183766
docker
build_linux_37

00:03:03

failed #183763
macosx
build_macosx_36

00:03:06

failed #183764
macosx
build_macosx_37

00:03:04

 
Name Stage Failure
failed
build_linux_36 Build
bob/learn/libsvm/__init__.py      10      1    90%
----------------------------------------------------------------------
Ran 19 tests in 0.112s

FAILED (errors=1, failures=2)
Tests failed for bob.learn.libsvm-2.1.4b0-py36h37dd6c6_47.conda - moving package to /scratch/builds/bob/bob.learn.libsvm/miniconda/conda-bld/broken
WARNING:conda_build.build:Tests failed for bob.learn.libsvm-2.1.4b0-py36h37dd6c6_47.conda - moving package to /scratch/builds/bob/bob.learn.libsvm/miniconda/conda-bld/broken
TESTS FAILED: bob.learn.libsvm-2.1.4b0-py36h37dd6c6_47.conda
ERROR: Job failed: exit code 1
failed
build_linux_37 Build
bob/learn/libsvm/__init__.py      10      1    90%
----------------------------------------------------------------------
Ran 19 tests in 0.139s

FAILED (errors=1, failures=2)
Tests failed for bob.learn.libsvm-2.1.4b0-py37h37dd6c6_43.conda - moving package to /scratch/builds/bob/bob.learn.libsvm/miniconda/conda-bld/broken
WARNING:conda_build.build:Tests failed for bob.learn.libsvm-2.1.4b0-py37h37dd6c6_43.conda - moving package to /scratch/builds/bob/bob.learn.libsvm/miniconda/conda-bld/broken
TESTS FAILED: bob.learn.libsvm-2.1.4b0-py37h37dd6c6_43.conda
ERROR: Job failed: exit code 1
failed
build_macosx_36 Build
bob/learn/libsvm/__init__.py      10      1    90%
----------------------------------------------------------------------
Ran 19 tests in 0.138s

FAILED (errors=1, failures=2)
Tests failed for bob.learn.libsvm-2.1.4b0-py36h2432bb8_46.conda - moving package to /Users/gitlab/builds/b6d3167a/0/bob/bob.learn.libsvm/miniconda/conda-bld/broken
WARNING:conda_build.build:Tests failed for bob.learn.libsvm-2.1.4b0-py36h2432bb8_46.conda - moving package to /Users/gitlab/builds/b6d3167a/0/bob/bob.learn.libsvm/miniconda/conda-bld/broken
TESTS FAILED: bob.learn.libsvm-2.1.4b0-py36h2432bb8_46.conda
ERROR: Job failed: exit status 1
failed
build_macosx_37 Build
bob/learn/libsvm/__init__.py      10      1    90%
----------------------------------------------------------------------
Ran 19 tests in 0.130s

FAILED (errors=1, failures=2)
Tests failed for bob.learn.libsvm-2.1.4b0-py37h2432bb8_46.conda - moving package to /Users/gitlab/builds/b6d3167a/1/bob/bob.learn.libsvm/miniconda/conda-bld/broken
WARNING:conda_build.build:Tests failed for bob.learn.libsvm-2.1.4b0-py37h2432bb8_46.conda - moving package to /Users/gitlab/builds/b6d3167a/1/bob/bob.learn.libsvm/miniconda/conda-bld/broken
TESTS FAILED: bob.learn.libsvm-2.1.4b0-py37h2432bb8_46.conda
ERROR: Job failed: exit status 1