[test] Fix precision test to be a bit softer on floating-point comparisons

4 jobs for fix-floating-point-cmp in 9 minutes (queued for 1 second)
Status Job ID Name Coverage
  Build
failed #183761
docker
build_linux_36

00:03:06

failed #183762
docker
build_linux_37

00:03:10

failed #183759
macosx
build_macosx_36

00:09:00

failed #183760
macosx
build_macosx_37

00:08:59

 
Name Stage Failure
failed
build_macosx_37 Build
bob/learn/libsvm/__init__.py      10      1    90%
----------------------------------------------------------------------
Ran 19 tests in 0.195s

FAILED (failures=3)
Tests failed for bob.learn.libsvm-2.1.4b0-py37h2432bb8_46.conda - moving package to /Users/gitlab/builds/f6f95b82/1/bob/bob.learn.libsvm/miniconda/conda-bld/broken
WARNING:conda_build.build:Tests failed for bob.learn.libsvm-2.1.4b0-py37h2432bb8_46.conda - moving package to /Users/gitlab/builds/f6f95b82/1/bob/bob.learn.libsvm/miniconda/conda-bld/broken
TESTS FAILED: bob.learn.libsvm-2.1.4b0-py37h2432bb8_46.conda
ERROR: Job failed: exit status 1
failed
build_macosx_36 Build
bob/learn/libsvm/__init__.py      10      1    90%
----------------------------------------------------------------------
Ran 19 tests in 0.188s

FAILED (failures=3)
Tests failed for bob.learn.libsvm-2.1.4b0-py36h2432bb8_46.conda - moving package to /Users/gitlab/builds/f6f95b82/0/bob/bob.learn.libsvm/miniconda/conda-bld/broken
WARNING:conda_build.build:Tests failed for bob.learn.libsvm-2.1.4b0-py36h2432bb8_46.conda - moving package to /Users/gitlab/builds/f6f95b82/0/bob/bob.learn.libsvm/miniconda/conda-bld/broken
TESTS FAILED: bob.learn.libsvm-2.1.4b0-py36h2432bb8_46.conda
ERROR: Job failed: exit status 1
failed
build_linux_37 Build
bob/learn/libsvm/__init__.py      10      1    90%
----------------------------------------------------------------------
Ran 19 tests in 0.148s

FAILED (failures=3)
Tests failed for bob.learn.libsvm-2.1.4b0-py37h37dd6c6_43.conda - moving package to /scratch/builds/bob/bob.learn.libsvm/miniconda/conda-bld/broken
WARNING:conda_build.build:Tests failed for bob.learn.libsvm-2.1.4b0-py37h37dd6c6_43.conda - moving package to /scratch/builds/bob/bob.learn.libsvm/miniconda/conda-bld/broken
TESTS FAILED: bob.learn.libsvm-2.1.4b0-py37h37dd6c6_43.conda
ERROR: Job failed: exit code 1
failed
build_linux_36 Build
bob/learn/libsvm/__init__.py      10      1    90%
----------------------------------------------------------------------
Ran 19 tests in 0.130s

FAILED (failures=3)
Tests failed for bob.learn.libsvm-2.1.4b0-py36h37dd6c6_47.conda - moving package to /scratch/builds/bob/bob.learn.libsvm/miniconda/conda-bld/broken
WARNING:conda_build.build:Tests failed for bob.learn.libsvm-2.1.4b0-py36h37dd6c6_47.conda - moving package to /scratch/builds/bob/bob.learn.libsvm/miniconda/conda-bld/broken
TESTS FAILED: bob.learn.libsvm-2.1.4b0-py36h37dd6c6_47.conda
ERROR: Job failed: exit code 1