Migrate to conda based CI

10 jobs for condapackage in 43 minutes and 9 seconds (queued for 49 minutes and 8 seconds)
Status Job ID Name Coverage
  Build
failed #116738
docker
build_linux_27

00:15:44

failed #116739
docker
build_linux_36

00:14:37

failed #116740
macosx
build_macosx_27

00:07:08

failed #116741
macosx
build_macosx_36

00:12:48

canceled #115601
docker
build_linux_27

canceled #115602
docker
build_linux_36

failed #115603
macosx
build_macosx_27

00:03:14

failed #115604
macosx
build_macosx_36

00:02:45

 
  Deploy
skipped #116742
deployer
deploy_beta
canceled #115605
deployer
deploy_beta

 
Name Stage Failure
failed
build_macosx_36 Build There is an unknown failure, please try again
  File "/Users/buildbot/work/gitlab-ci/f6f95b82/1/bob/bob.learn.libsvm/miniconda/lib/python3.6/site-packages/conda/instructions.py", line 64, in PROGRESSIVEFETCHEXTRACT_CMD
progressive_fetch_extract.execute()
File "/Users/buildbot/work/gitlab-ci/f6f95b82/1/bob/bob.learn.libsvm/miniconda/lib/python3.6/site-packages/conda/core/package_cache.py", line 581, in execute
raise CondaMultiError(exceptions)
conda.CondaMultiError: [Errno 28] No space left on device: '/Users/buildbot/work/gitlab-ci/f6f95b82/1/bob/bob.learn.libsvm/miniconda/pkgs/bzip2-1.0.6-h649919c_2/bin/bzip2recover'
[Errno 28] No space left on device: '/Users/buildbot/work/gitlab-ci/f6f95b82/1/bob/bob.learn.libsvm/miniconda/pkgs/py-boost-1.65.1-py36h1439ea1_4/info/hash_input.json'

(21:39:06.587)
Error: Command Failed "/Users/buildbot/work/gitlab-ci/f6f95b82/1/bob/bob.learn.libsvm/miniconda/bin/conda build --no-anaconda-upload --variant-config-files _ci/conda_build_config.yaml --python=3.6 conda"
ERROR: Job failed: exit status 1
failed
build_macosx_27 Build There is an unknown failure, please try again
    extra_run_specs = get_upstream_pins(m, actions, env)
File "/Users/buildbot/work/gitlab-ci/f6f95b82/0/bob/bob.learn.libsvm/miniconda/lib/python3.6/site-packages/conda_build/render.py", line 265, in get_upstream_pins
pfe.execute()
File "/Users/buildbot/work/gitlab-ci/f6f95b82/0/bob/bob.learn.libsvm/miniconda/lib/python3.6/site-packages/conda/core/package_cache.py", line 581, in execute
raise CondaMultiError(exceptions)
conda.CondaMultiError: [Errno 28] No space left on device: '/Users/buildbot/work/gitlab-ci/f6f95b82/0/bob/bob.learn.libsvm/miniconda/pkgs/python-2.7.14-hde5916a_29/lib/python2.7/distutils/command/build_clib.py'

(21:33:26.083)
Error: Command Failed "/Users/buildbot/work/gitlab-ci/f6f95b82/0/bob/bob.learn.libsvm/miniconda/bin/conda build --no-anaconda-upload --variant-config-files _ci/conda_build_config.yaml --python=2.7 conda"
ERROR: Job failed: exit status 1
failed
build_linux_36 Build There is an unknown failure, please try again
Ran 17 tests in 0.106s

FAILED (failures=1)
Tests failed for bob.learn.libsvm-2.0.14b0-py36h3d2f5f9_0.tar.bz2 - moving package to /local/builds/bob/bob.learn.libsvm/miniconda/conda-bld/broken
WARNING:conda_build.build:Tests failed for bob.learn.libsvm-2.0.14b0-py36h3d2f5f9_0.tar.bz2 - moving package to /local/builds/bob/bob.learn.libsvm/miniconda/conda-bld/broken
removing: bob.learn.libsvm-2.0.14b0-py36h3d2f5f9_0.tar.bz2
TESTS FAILED: bob.learn.libsvm-2.0.14b0-py36h3d2f5f9_0.tar.bz2
(21:01:38.436)
Error: Command Failed "/local/builds/bob/bob.learn.libsvm/miniconda/bin/conda build --no-anaconda-upload --variant-config-files _ci/conda_build_config.yaml --python=3.6 conda"
ERROR: Job failed: exit code 1
failed
build_linux_27 Build There is an unknown failure, please try again
Ran 17 tests in 0.102s

FAILED (failures=1)
Tests failed for bob.learn.libsvm-2.0.14b0-py27h3d2f5f9_0.tar.bz2 - moving package to /local/builds/bob/bob.learn.libsvm/miniconda/conda-bld/broken
WARNING:conda_build.build:Tests failed for bob.learn.libsvm-2.0.14b0-py27h3d2f5f9_0.tar.bz2 - moving package to /local/builds/bob/bob.learn.libsvm/miniconda/conda-bld/broken
removing: bob.learn.libsvm-2.0.14b0-py27h3d2f5f9_0.tar.bz2
TESTS FAILED: bob.learn.libsvm-2.0.14b0-py27h3d2f5f9_0.tar.bz2
(20:46:52.408)
Error: Command Failed "/local/builds/bob/bob.learn.libsvm/miniconda/bin/conda build --no-anaconda-upload --variant-config-files _ci/conda_build_config.yaml --python=2.7 conda"
ERROR: Job failed: exit code 1