Revert "Revert "Re-enabled a PLDA test that has been disabled""

This reverts commit 8dfe578d
12 jobs from revert-8dfe578d in 50 minutes 4 seconds (queued for 6 minutes 24 seconds)
Status Job ID Name Coverage
  Build
passed #57703
conda-linux
build_linux_27

06:10

passed #57705
conda-linux
build_linux_34

09:06

passed #57707
conda-linux
build_linux_35

07:58

passed #57708
conda-macosx
build_macosx_27

08:20

passed #57706
conda-macosx
build_macosx_34

10:46

passed #57704
conda-macosx
build_macosx_35

11:02

 
  Test
failed #57713
conda-linux
test_linux_27

01:49

failed #57711
conda-linux
test_linux_34

03:08

failed #57709
conda-linux
test_linux_35

03:19

failed #57710
conda-macosx
test_macosx_27

02:00

failed #57712
conda-macosx
test_macosx_34

01:35

failed #57714
conda-macosx
test_macosx_35

01:39

 

----------------------------------------------------------------------
Ran 48 tests in 1.983s

FAILED (failures=1)
(00:35:19) Error: Command Failed "/home/gitlab-runner/builds/0d638152/0/bob/bob.learn.em/build-prefix/bin/coverage run --source=bob.learn.em /home/gitlab-runner/builds/0d638152/0/bob/bob.learn.em/build-prefix/bin/nosetests -sv bob.learn.em"
Running after script...
$ ./_ci/after_test.sh
ERROR: Job failed: exit status 1

----------------------------------------------------------------------
Ran 48 tests in 0.515s

FAILED (failures=1)
(00:42:49) Error: Command Failed "/Users/buildbot/work/gitlab-ci/f6f95b82/0/bob/bob.learn.em/build-prefix/bin/coverage run --source=bob.learn.em /Users/buildbot/work/gitlab-ci/f6f95b82/0/bob/bob.learn.em/build-prefix/bin/nosetests -sv bob.learn.em"
Running after script...
$ ./_ci/after_test.sh
ERROR: Job failed: exit status 1

----------------------------------------------------------------------
Ran 48 tests in 0.217s

FAILED (failures=1)
(00:38:32) Error: Command Failed "/home/gitlab-runner/builds/0d638152/0/bob/bob.learn.em/build-prefix/bin/coverage run --source=bob.learn.em /home/gitlab-runner/builds/0d638152/0/bob/bob.learn.em/build-prefix/bin/nosetests -sv bob.learn.em"
Running after script...
$ ./_ci/after_test.sh
ERROR: Job failed: exit status 1

----------------------------------------------------------------------
Ran 48 tests in 0.568s

FAILED (failures=1)
(00:44:24) Error: Command Failed "/Users/buildbot/work/gitlab-ci/f6f95b82/0/bob/bob.learn.em/build-prefix/bin/coverage run --source=bob.learn.em /Users/buildbot/work/gitlab-ci/f6f95b82/0/bob/bob.learn.em/build-prefix/bin/nosetests -sv bob.learn.em"
Running after script...
$ ./_ci/after_test.sh
ERROR: Job failed: exit status 1

----------------------------------------------------------------------
Ran 48 tests in 0.827s

FAILED (failures=1)
(00:40:26) Error: Command Failed "/home/gitlab-runner/builds/0d638152/0/bob/bob.learn.em/build-prefix/bin/coverage run --source=bob.learn.em /home/gitlab-runner/builds/0d638152/0/bob/bob.learn.em/build-prefix/bin/nosetests -sv bob.learn.em"
Running after script...
$ ./_ci/after_test.sh
ERROR: Job failed: exit status 1

----------------------------------------------------------------------
Ran 48 tests in 0.445s

FAILED (failures=1)
(00:46:04) Error: Command Failed "/Users/buildbot/work/gitlab-ci/f6f95b82/0/bob/bob.learn.em/build-prefix/bin/coverage run --source=bob.learn.em /Users/buildbot/work/gitlab-ci/f6f95b82/0/bob/bob.learn.em/build-prefix/bin/nosetests -sv bob.learn.em"
Running after script...
$ ./_ci/after_test.sh
ERROR: Job failed: exit status 1