[conda recipe] Add make next to cmake dependency

5 jobs for master in 8 minutes and 27 seconds (queued for 2 seconds)
Status Job ID Name Coverage
  Build
failed #217283
docker
build_linux_36

00:07:56

98.0%
failed #217284
docker
build_linux_37

00:08:03

98.0%
failed #217281
macosx
build_macosx_36

00:08:27

98.0%
failed #217282
macosx
build_macosx_37

00:08:18

98.0%
 
  Deploy
skipped #217285
docker
deploy_beta
 
Name Stage Failure
failed
build_macosx_36 Build
WARNING conda_build.build:tests_failed(2896): Tests failed for bob.learn.em-2.1.7b0-py36hc08e36c_24.conda - moving package to /Users/gitlab/builds/b6d3167a/0/bob/bob.learn.em/miniconda/conda-bld/broken
TESTS FAILED: bob.learn.em-2.1.7b0-py36hc08e36c_24.conda
Uploading artifacts for failed job
Uploading artifacts...
Runtime platform
arch=amd64 os=darwin pid=94007 revision=ece86343 version=13.5.0
WARNING: coverage.xml: no matching files
ERROR: No files to upload
Cleaning up file based variables
ERROR: Job failed: exit status 1
failed
build_macosx_37 Build
WARNING conda_build.build:tests_failed(2896): Tests failed for bob.learn.em-2.1.7b0-py37hc08e36c_22.conda - moving package to /Users/gitlab/builds/b6d3167a/1/bob/bob.learn.em/miniconda/conda-bld/broken
TESTS FAILED: bob.learn.em-2.1.7b0-py37hc08e36c_22.conda
Uploading artifacts for failed job
Uploading artifacts...
Runtime platform
arch=amd64 os=darwin pid=93985 revision=ece86343 version=13.5.0
WARNING: coverage.xml: no matching files
ERROR: No files to upload
Cleaning up file based variables
ERROR: Job failed: exit status 1
failed
build_linux_37 Build
Tests failed for bob.learn.em-2.1.7b0-py37h19d3953_25.conda - moving package to /scratch/builds/bob/bob.learn.em/miniconda/conda-bld/broken
WARNING conda_build.build:tests_failed(2896): Tests failed for bob.learn.em-2.1.7b0-py37h19d3953_25.conda - moving package to /scratch/builds/bob/bob.learn.em/miniconda/conda-bld/broken
TESTS FAILED: bob.learn.em-2.1.7b0-py37h19d3953_25.conda
Uploading artifacts for failed job
Uploading artifacts...
WARNING: coverage.xml: no matching files
ERROR: No files to upload
Cleaning up file based variables
ERROR: Job failed: exit code 1
failed
build_linux_36 Build
Tests failed for bob.learn.em-2.1.7b0-py36h19d3953_24.conda - moving package to /scratch/builds/bob/bob.learn.em/miniconda/conda-bld/broken
WARNING conda_build.build:tests_failed(2896): Tests failed for bob.learn.em-2.1.7b0-py36h19d3953_24.conda - moving package to /scratch/builds/bob/bob.learn.em/miniconda/conda-bld/broken
TESTS FAILED: bob.learn.em-2.1.7b0-py36h19d3953_24.conda
Uploading artifacts for failed job
Uploading artifacts...
WARNING: coverage.xml: no matching files
ERROR: No files to upload
Cleaning up file based variables
ERROR: Job failed: exit code 1