Trial to implement EM with multiprocessing

12 jobs from multiprocessing in 95 minutes 13 seconds (queued for 3 seconds)
Status Job ID Name Coverage
  Build
passed #14055
conda-linux
build_linux_27

08:19

passed #14056
conda-linux
build_linux_34

09:17

passed #14057
conda-linux
build_linux_35

10:19

passed #14058
conda-macosx
build_macosx_27

17:13

passed #14059
conda-macosx
build_macosx_34

15:29

passed #14060
conda-macosx
build_macosx_35

13:49

 
  Test
failed #14061
conda-linux
test_linux_27

01:31

failed #14062
conda-linux
test_linux_34

03:30

failed #14063
conda-linux
test_linux_35

02:29

failed #14064
conda-macosx
test_macosx_27

06:39

failed #14065
conda-macosx
test_macosx_34

04:29

failed #14066
conda-macosx
test_macosx_35

02:09

 
Name Stage Failure
failed
test_linux_27 Test There is an unknown failure, please try again
RuntimeError: bob.learn.em.ML_GMMTrainer - cannot perform the e_step method: C++ exception caught: 'array dimensions do not match 0 != 5'

----------------------------------------------------------------------
Ran 48 tests in 3.913s

FAILED (errors=1)
Running after script...
$ rm -rf ${CONDA_PREFIX}
ERROR: Build failed: exit status 1
failed
test_linux_34 Test There is an unknown failure, please try again
RuntimeError: bob.learn.em.ML_GMMTrainer - cannot perform the e_step method: C++ exception caught: 'array dimensions do not match 0 != 5'

----------------------------------------------------------------------
Ran 48 tests in 3.888s

FAILED (errors=1)
Running after script...
$ rm -rf ${CONDA_PREFIX}
ERROR: Build failed: exit status 1
failed
test_linux_35 Test There is an unknown failure, please try again
RuntimeError: bob.learn.em.ML_GMMTrainer - cannot perform the e_step method: C++ exception caught: 'array dimensions do not match 0 != 5'

----------------------------------------------------------------------
Ran 48 tests in 3.447s

FAILED (errors=1)
Running after script...
$ rm -rf ${CONDA_PREFIX}
ERROR: Build failed: exit status 1
failed
test_macosx_27 Test There is an unknown failure, please try again
RuntimeError: bob.learn.em.ML_GMMTrainer - cannot perform the e_step method: C++ exception caught: 'array dimensions do not match 0 != 5'

----------------------------------------------------------------------
Ran 48 tests in 9.753s

FAILED (errors=1)
Running after script...
$ rm -rf ${CONDA_PREFIX}
ERROR: Build failed: exit status 1
failed
test_macosx_34 Test There is an unknown failure, please try again
RuntimeError: bob.learn.em.ML_GMMTrainer - cannot perform the e_step method: C++ exception caught: 'array dimensions do not match 0 != 5'

----------------------------------------------------------------------
Ran 48 tests in 10.334s

FAILED (errors=1)
Running after script...
$ rm -rf ${CONDA_PREFIX}
ERROR: Build failed: exit status 1
failed
test_macosx_35 Test There is an unknown failure, please try again
RuntimeError: bob.learn.em.ML_GMMTrainer - cannot perform the e_step method: C++ exception caught: 'array dimensions do not match 0 != 5'

----------------------------------------------------------------------
Ran 48 tests in 11.120s

FAILED (errors=1)
Running after script...
$ rm -rf ${CONDA_PREFIX}
ERROR: Build failed: exit status 1