Temporally add bob.pipelines as dependency [conda]

4 jobs for dask-pipelines in 8 minutes and 21 seconds (queued for 1 second)
Status Job ID Name Coverage
  Build
failed #196240
docker
build_linux_36

00:08:04

84.0%
failed #196241
docker
build_linux_37

00:08:08

84.0%
failed #196238
macosx
build_macosx_36

00:08:15

84.0%
failed #196239
macosx
build_macosx_37

00:08:03

84.0%
 
Name Stage Failure
failed
build_macosx_36 Build
WARNING:conda_build.build:Tests failed for bob.learn.em-2.1.6b0-py36hbd0a78b_51.conda - moving package to /Users/gitlab/builds/b6d3167a/0/bob/bob.learn.em/miniconda/conda-bld/broken
TESTS FAILED: bob.learn.em-2.1.6b0-py36hbd0a78b_51.conda
Running after_script
Uploading artifacts for failed job
Uploading artifacts...
Runtime platform
arch=amd64 os=darwin pid=90488 revision=4c96e5ad version=12.9.0
WARNING: coverage.xml: no matching files
ERROR: No files to upload
ERROR: Job failed: exit status 1
failed
build_macosx_37 Build
WARNING:conda_build.build:Tests failed for bob.learn.em-2.1.6b0-py37hbd0a78b_51.conda - moving package to /Users/gitlab/builds/b6d3167a/1/bob/bob.learn.em/miniconda/conda-bld/broken
TESTS FAILED: bob.learn.em-2.1.6b0-py37hbd0a78b_51.conda
Running after_script
Uploading artifacts for failed job
Uploading artifacts...
Runtime platform
arch=amd64 os=darwin pid=90437 revision=4c96e5ad version=12.9.0
WARNING: coverage.xml: no matching files
ERROR: No files to upload
ERROR: Job failed: exit status 1
failed
build_linux_37 Build
Tests failed for bob.learn.em-2.1.6b0-py37hc1e0618_50.conda - moving package to /scratch/builds/bob/bob.learn.em/miniconda/conda-bld/broken
WARNING:conda_build.build:Tests failed for bob.learn.em-2.1.6b0-py37hc1e0618_50.conda - moving package to /scratch/builds/bob/bob.learn.em/miniconda/conda-bld/broken
TESTS FAILED: bob.learn.em-2.1.6b0-py37hc1e0618_50.conda
Running after_script
Uploading artifacts for failed job
Uploading artifacts...
WARNING: coverage.xml: no matching files
ERROR: No files to upload
ERROR: Job failed: exit code 1
failed
build_linux_36 Build
Tests failed for bob.learn.em-2.1.6b0-py36hc1e0618_53.conda - moving package to /scratch/builds/bob/bob.learn.em/miniconda/conda-bld/broken
WARNING:conda_build.build:Tests failed for bob.learn.em-2.1.6b0-py36hc1e0618_53.conda - moving package to /scratch/builds/bob/bob.learn.em/miniconda/conda-bld/broken
TESTS FAILED: bob.learn.em-2.1.6b0-py36hc1e0618_53.conda
Running after_script
Uploading artifacts for failed job
Uploading artifacts...
WARNING: coverage.xml: no matching files
ERROR: No files to upload
ERROR: Job failed: exit code 1