Added reference [Bishop1999] issue #27

Added reference [Bishop1999] issue #27
5 jobs for condapackage in 37 minutes and 48 seconds (queued for 3 seconds)
Status Job ID Name Coverage
  Build
failed #117063
docker
build_linux_27

00:29:24

86.0%
failed #117064
docker
build_linux_36

00:29:12

86.0%
failed #117065
macosx
build_macosx_27

00:37:47

86.0%
failed #117066
macosx
build_macosx_36

00:37:21

86.0%
 
  Deploy
skipped #117067
deployer
deploy_beta
 
Name Stage Failure
failed
build_macosx_36 Build There is an unknown failure, please try again

Warning, treated as error:
/Users/buildbot/work/gitlab-ci/f6f95b82/1/bob/bob.learn.em/miniconda/conda-bld/bob.learn.em_1516563585416/_test_env_placehold_placehold_placehold_placehold_placehold_placehold_placehold_placehold_placehold_placehold_placehold_placehold_placehold_placehold/lib/python3.6/site-packages/bob/learn/em/__init__.py:docstring of bob.learn.em.PLDAMachine:5:citation not found: ElShafey2014
Tests failed for bob.learn.em-2.1.1b0-py36hf56bda5_0.tar.bz2 - moving package to /Users/buildbot/work/gitlab-ci/f6f95b82/1/bob/bob.learn.em/miniconda/conda-bld/broken
WARNING:conda_build.build:Tests failed for bob.learn.em-2.1.1b0-py36hf56bda5_0.tar.bz2 - moving package to /Users/buildbot/work/gitlab-ci/f6f95b82/1/bob/bob.learn.em/miniconda/conda-bld/broken
removing: bob.learn.em-2.1.1b0-py36hf56bda5_0.tar.bz2
TESTS FAILED: bob.learn.em-2.1.1b0-py36hf56bda5_0.tar.bz2
(21:12:51.092)
Error: Command Failed "/Users/buildbot/work/gitlab-ci/f6f95b82/1/bob/bob.learn.em/miniconda/bin/conda build --no-anaconda-upload --variant-config-files _ci/conda_build_config.yaml --python=3.6 conda"
ERROR: Job failed: exit status 1
failed
build_macosx_27 Build There is an unknown failure, please try again

Warning, treated as error:
/Users/buildbot/work/gitlab-ci/f6f95b82/0/bob/bob.learn.em/miniconda/conda-bld/bob.learn.em_1516563587022/_test_env_placehold_placehold_placehold_placehold_placehold_placehold_placehold_placehold_placehold_placehold_placehold_placehold_placehold_placehold/lib/python2.7/site-packages/bob/learn/em/__init__.py:docstring of bob.learn.em.PLDAMachine:5:citation not found: ElShafey2014
Tests failed for bob.learn.em-2.1.1b0-py27hf56bda5_0.tar.bz2 - moving package to /Users/buildbot/work/gitlab-ci/f6f95b82/0/bob/bob.learn.em/miniconda/conda-bld/broken
WARNING:conda_build.build:Tests failed for bob.learn.em-2.1.1b0-py27hf56bda5_0.tar.bz2 - moving package to /Users/buildbot/work/gitlab-ci/f6f95b82/0/bob/bob.learn.em/miniconda/conda-bld/broken
removing: bob.learn.em-2.1.1b0-py27hf56bda5_0.tar.bz2
TESTS FAILED: bob.learn.em-2.1.1b0-py27hf56bda5_0.tar.bz2
(21:13:18.527)
Error: Command Failed "/Users/buildbot/work/gitlab-ci/f6f95b82/0/bob/bob.learn.em/miniconda/bin/conda build --no-anaconda-upload --variant-config-files _ci/conda_build_config.yaml --python=2.7 conda"
ERROR: Job failed: exit status 1
failed
build_linux_36 Build There is an unknown failure, please try again

Warning, treated as error:
/local/builds/bob/bob.learn.em/miniconda/conda-bld/bob.learn.em_1516562944382/_test_env_placehold_placehold_placehold_placehold_placehold_placehold_placehold_placehold_placehold_placehold_placehold_placehold_placehold_placehold_placehold_placehold_placeho/lib/python3.6/site-packages/bob/learn/em/__init__.py:docstring of bob.learn.em.PLDAMachine:5:citation not found: ElShafey2014
Tests failed for bob.learn.em-2.1.1b0-py36h74fd032_0.tar.bz2 - moving package to /local/builds/bob/bob.learn.em/miniconda/conda-bld/broken
WARNING:conda_build.build:Tests failed for bob.learn.em-2.1.1b0-py36h74fd032_0.tar.bz2 - moving package to /local/builds/bob/bob.learn.em/miniconda/conda-bld/broken
removing: bob.learn.em-2.1.1b0-py36h74fd032_0.tar.bz2
TESTS FAILED: bob.learn.em-2.1.1b0-py36h74fd032_0.tar.bz2
(19:55:06.757)
Error: Command Failed "/local/builds/bob/bob.learn.em/miniconda/bin/conda build --no-anaconda-upload --variant-config-files _ci/conda_build_config.yaml --python=3.6 conda"
ERROR: Job failed: exit code 1
failed
build_linux_27 Build There is an unknown failure, please try again

Warning, treated as error:
/local/builds/bob/bob.learn.em/miniconda/conda-bld/bob.learn.em_1516562941490/_test_env_placehold_placehold_placehold_placehold_placehold_placehold_placehold_placehold_placehold_placehold_placehold_placehold_placehold_placehold_placehold_placehold_placeho/lib/python2.7/site-packages/bob/learn/em/__init__.py:docstring of bob.learn.em.PLDAMachine:5:citation not found: ElShafey2014
Tests failed for bob.learn.em-2.1.1b0-py27h74fd032_0.tar.bz2 - moving package to /local/builds/bob/bob.learn.em/miniconda/conda-bld/broken
WARNING:conda_build.build:Tests failed for bob.learn.em-2.1.1b0-py27h74fd032_0.tar.bz2 - moving package to /local/builds/bob/bob.learn.em/miniconda/conda-bld/broken
removing: bob.learn.em-2.1.1b0-py27h74fd032_0.tar.bz2
TESTS FAILED: bob.learn.em-2.1.1b0-py27h74fd032_0.tar.bz2
(19:55:19.385)
Error: Command Failed "/local/builds/bob/bob.learn.em/miniconda/bin/conda build --no-anaconda-upload --variant-config-files _ci/conda_build_config.yaml --python=2.7 conda"
ERROR: Job failed: exit code 1