Add MTCNN (tensorflow) model

2 jobs from mtcnn in 16 minutes and 48 seconds (queued for 1 second)
Status Job ID Name Coverage
  Build
failed #164124
docker
build_linux_36

00:16:48

failed #164125
macosx
build_macosx_36

00:12:08

 
Name Stage Failure
failed
build_linux_36 Build
TOTAL                                        376     92    76%
----------------------------------------------------------------------
Ran 5 tests in 32.765s

FAILED (errors=1)
Tests failed for bob.ip.tensorflow_extractor-0.0.4b0-py36h03a3578_31.tar.bz2 - moving package to /scratch/builds/bob/bob.ip.tensorflow_extractor/miniconda/conda-bld/broken
WARNING:conda_build.build:Tests failed for bob.ip.tensorflow_extractor-0.0.4b0-py36h03a3578_31.tar.bz2 - moving package to /scratch/builds/bob/bob.ip.tensorflow_extractor/miniconda/conda-bld/broken
TESTS FAILED: bob.ip.tensorflow_extractor-0.0.4b0-py36h03a3578_31.tar.bz2
ERROR: Job failed: exit code 1
failed
build_macosx_36 Build
TOTAL                                        376     92    76%
----------------------------------------------------------------------
Ran 5 tests in 43.547s

FAILED (errors=1)
Tests failed for bob.ip.tensorflow_extractor-0.0.4b0-py36h03a3578_10.tar.bz2 - moving package to /Users/gitlab/builds/b6d3167a/0/bob/bob.ip.tensorflow_extractor/miniconda/conda-bld/broken
WARNING:conda_build.build:Tests failed for bob.ip.tensorflow_extractor-0.0.4b0-py36h03a3578_10.tar.bz2 - moving package to /Users/gitlab/builds/b6d3167a/0/bob/bob.ip.tensorflow_extractor/miniconda/conda-bld/broken
TESTS FAILED: bob.ip.tensorflow_extractor-0.0.4b0-py36h03a3578_10.tar.bz2
ERROR: Job failed: exit status 1