Adapt calibration script to new bob.io.stream file format

5 jobs for metadata_refactoring in 18 minutes and 3 seconds (queued for 3 seconds)
latest
Name Stage Failure
failed
build_macos_intel_39 Build
Tests failed for bob.ip.stereo-1.0.2b0-py39h6aef8a0_56.conda - moving package to /Users/gitlab/builds/6eE8C-FW/1/bob/bob.ip.stereo/miniconda/conda-bld/broken
TESTS FAILED: bob.ip.stereo-1.0.2b0-py39h6aef8a0_56.conda
Uploading artifacts for failed job
Uploading artifacts...
Runtime platform
arch=amd64 os=darwin pid=7013 revision=c6bb62f6 version=14.10.0
WARNING: coverage.xml: no matching files
ERROR: No files to upload
Cleaning up project directory and file based variables
ERROR: Job failed: exit status 1

failed
build_macos_intel_38 Build
Tests failed for bob.ip.stereo-1.0.2b0-py38h6aef8a0_62.conda - moving package to /Users/gitlab/builds/6eE8C-FW/0/bob/bob.ip.stereo/miniconda/conda-bld/broken
TESTS FAILED: bob.ip.stereo-1.0.2b0-py38h6aef8a0_62.conda
Uploading artifacts for failed job
Uploading artifacts...
Runtime platform
arch=amd64 os=darwin pid=7012 revision=c6bb62f6 version=14.10.0
WARNING: coverage.xml: no matching files
ERROR: No files to upload
Cleaning up project directory and file based variables
ERROR: Job failed: exit status 1

failed
build_linux_39 Build
OSError: libbob_io_base.so: cannot open shared object file: No such file or directory
Tests failed for bob.ip.stereo-1.0.2b0-py39hd117553_66.conda - moving package to /scratch/builds/bob/bob.ip.stereo/miniconda/conda-bld/broken
TESTS FAILED: bob.ip.stereo-1.0.2b0-py39hd117553_66.conda
Uploading artifacts for failed job
Uploading artifacts...
WARNING: coverage.xml: no matching files
ERROR: No files to upload
Cleaning up project directory and file based variables
ERROR: Job failed: exit code 1

failed
build_linux_38 Build
OSError: libbob_io_base.so: cannot open shared object file: No such file or directory
Tests failed for bob.ip.stereo-1.0.2b0-py38hd117553_71.conda - moving package to /scratch/builds/bob/bob.ip.stereo/miniconda/conda-bld/broken
TESTS FAILED: bob.ip.stereo-1.0.2b0-py38hd117553_71.conda
Uploading artifacts for failed job
Uploading artifacts...
WARNING: coverage.xml: no matching files
ERROR: No files to upload
Cleaning up project directory and file based variables
ERROR: Job failed: exit code 1

failed
build_macos_arm_39 Build
Tests failed for bob.ip.stereo-1.0.2b0-py39h7143c84_24.conda - moving package to /Users/gitlab/builds/sAZPGTqW/0/bob/bob.ip.stereo/miniconda/conda-bld/broken
TESTS FAILED: bob.ip.stereo-1.0.2b0-py39h7143c84_24.conda
Uploading artifacts for failed job
Uploading artifacts...
Runtime platform
arch=arm64 os=darwin pid=64586 revision=c6bb62f6 version=14.10.0
WARNING: coverage.xml: no matching files
ERROR: No files to upload
Cleaning up project directory and file based variables
ERROR: Job failed: exit status 1