[WIP] stereo running on gpu

4 jobs for cuda_stereo in 28 minutes and 52 seconds (queued for 6 seconds)
latest
Name Stage Failure
failed
build_macos_intel_38 Build
FAILED (errors=1)
Tests failed for bob.ip.stereo-0.0.1b0-py38h276c90a_0.conda - moving package to /Users/gitlab/builds/nrU4yQP1/0/bob/bob.ip.stereo/miniconda/conda-bld/broken
TESTS FAILED: bob.ip.stereo-0.0.1b0-py38h276c90a_0.conda
Uploading artifacts for failed job
Uploading artifacts...
Runtime platform
arch=amd64 os=darwin pid=15206 revision=58ba2b95 version=14.2.0
WARNING: coverage.xml: no matching files
ERROR: No files to upload
Cleaning up file based variables
ERROR: Job failed: exit status 1
failed
build_linux_37 Build

FAILED (errors=1)
Tests failed for bob.ip.stereo-0.0.1b0-py37hbbc36ac_0.conda - moving package to /scratch/builds/bob/bob.ip.stereo/miniconda/conda-bld/broken
TESTS FAILED: bob.ip.stereo-0.0.1b0-py37hbbc36ac_0.conda
Uploading artifacts for failed job
Uploading artifacts...
WARNING: coverage.xml: no matching files
ERROR: No files to upload
Cleaning up file based variables
ERROR: Job failed: exit code 1
failed
build_macos_intel_37 Build
FAILED (errors=1)
Tests failed for bob.ip.stereo-0.0.1b0-py37h276c90a_0.conda - moving package to /Users/gitlab/builds/f6f95b82/0/bob/bob.ip.stereo/miniconda/conda-bld/broken
TESTS FAILED: bob.ip.stereo-0.0.1b0-py37h276c90a_0.conda
Uploading artifacts for failed job
Uploading artifacts...
Runtime platform
arch=amd64 os=darwin pid=47139 revision=58ba2b95 version=14.2.0
WARNING: coverage.xml: no matching files
ERROR: No files to upload
Cleaning up file based variables
ERROR: Job failed: exit status 1
failed
build_linux_38 Build

FAILED (errors=1)
Tests failed for bob.ip.stereo-0.0.1b0-py38hbbc36ac_0.conda - moving package to /scratch/builds/bob/bob.ip.stereo/miniconda/conda-bld/broken
TESTS FAILED: bob.ip.stereo-0.0.1b0-py38hbbc36ac_0.conda
Uploading artifacts for failed job
Uploading artifacts...
WARNING: coverage.xml: no matching files
ERROR: No files to upload
Cleaning up file based variables
ERROR: Job failed: exit code 1