fixed not-equal symbol for python3

15 jobs for master in 12 minutes and 40 seconds (queued for 4 seconds)
Status Job ID Name Coverage
  Build
passed #50880
conda-linux
build_linux_27

00:01:46

passed #50883
conda-linux
build_linux_34

00:01:49

passed #50885
conda-linux
build_linux_35

00:01:46

passed #50881
conda-macosx
build_macosx_27

00:04:06

passed #50884
conda-macosx
build_macosx_34

00:04:03

passed #50882
conda-macosx
build_macosx_35

00:04:03

 
  Test
failed #50889
conda-linux
test_linux_27

00:03:49

failed #50887
conda-linux
test_linux_34

00:01:17

failed #50886
conda-linux
test_linux_35

00:01:17

failed #50890
conda-macosx
test_macosx_27

00:08:34

failed #50888
conda-macosx
test_macosx_34

00:03:18

failed #50891
conda-macosx
test_macosx_35

00:03:17

 
  Docs
skipped #50892
conda-linux
docs_linux_35
 
  Wheels
skipped #50893
conda-linux
wheels_linux_27
skipped #50894
conda-linux
wheels_linux_35
 
Name Stage Failure
failed
test_macosx_35 Test There is an unknown failure, please try again

----------------------------------------------------------------------
Ran 1 test in 0.002s

FAILED (errors=1)
(14:25:06)
Error: Command Failed "/Users/buildbot/work/gitlab-ci/f6f95b82/2/bob/bob.ip.qualitymeasure/build-prefix/bin/coverage run --source=bob.ip.qualitymeasure /Users/buildbot/work/gitlab-ci/f6f95b82/2/bob/bob.ip.qualitymeasure/build-prefix/bin/nosetests -sv bob.ip.qualitymeasure"
Running after script...
$ ./_ci/after_test.sh
ERROR: Build failed: exit status 1
failed
test_macosx_27 Test There is an unknown failure, please try again
    9 tests
1 failure in tests
0 failures in setup code
0 failures in cleanup code
build finished with problems.
(14:30:22)
Error: Command Failed "/Users/buildbot/work/gitlab-ci/f6f95b82/1/bob/bob.ip.qualitymeasure/build-prefix/bin/sphinx-build -b doctest /Users/buildbot/work/gitlab-ci/f6f95b82/1/bob/bob.ip.qualitymeasure/doc bob.ip.qualitymeasure/sphinx"
Running after script...
$ ./_ci/after_test.sh
ERROR: Build failed: exit status 1
failed
test_linux_27 Test There is an unknown failure, please try again
    9 tests
1 failure in tests
0 failures in setup code
0 failures in cleanup code
build finished with problems.
(14:20:59)
Error: Command Failed "/home/gitlab-runner/builds/0d638152/2/bob/bob.ip.qualitymeasure/build-prefix/bin/sphinx-build -b doctest /home/gitlab-runner/builds/0d638152/2/bob/bob.ip.qualitymeasure/doc bob.ip.qualitymeasure/sphinx"
Running after script...
$ ./_ci/after_test.sh
ERROR: Build failed: exit status 1
failed
test_macosx_34 Test There is an unknown failure, please try again

----------------------------------------------------------------------
Ran 1 test in 0.002s

FAILED (errors=1)
(14:25:06)
Error: Command Failed "/Users/buildbot/work/gitlab-ci/f6f95b82/0/bob/bob.ip.qualitymeasure/build-prefix/bin/coverage run --source=bob.ip.qualitymeasure /Users/buildbot/work/gitlab-ci/f6f95b82/0/bob/bob.ip.qualitymeasure/build-prefix/bin/nosetests -sv bob.ip.qualitymeasure"
Running after script...
$ ./_ci/after_test.sh
ERROR: Build failed: exit status 1
failed
test_linux_34 Test There is an unknown failure, please try again

----------------------------------------------------------------------
Ran 1 test in 0.002s

FAILED (errors=1)
(14:18:26)
Error: Command Failed "/home/gitlab-runner/builds/0d638152/1/bob/bob.ip.qualitymeasure/build-prefix/bin/coverage run --source=bob.ip.qualitymeasure /home/gitlab-runner/builds/0d638152/1/bob/bob.ip.qualitymeasure/build-prefix/bin/nosetests -sv bob.ip.qualitymeasure"
Running after script...
$ ./_ci/after_test.sh
ERROR: Build failed: exit status 1
failed
test_linux_35 Test There is an unknown failure, please try again

----------------------------------------------------------------------
Ran 1 test in 0.002s

FAILED (errors=1)
(14:18:26)
Error: Command Failed "/home/gitlab-runner/builds/0d638152/0/bob/bob.ip.qualitymeasure/build-prefix/bin/coverage run --source=bob.ip.qualitymeasure /home/gitlab-runner/builds/0d638152/0/bob/bob.ip.qualitymeasure/build-prefix/bin/nosetests -sv bob.ip.qualitymeasure"
Running after script...
$ ./_ci/after_test.sh
ERROR: Build failed: exit status 1