[conda] Fixing dependencies

2 jobs for deprecation in 15 minutes and 19 seconds (queued for 1 second)
Status Job ID Name Coverage
  Build
failed #246938
docker
build_linux_38

00:08:09

0.0%
failed #246937
intel macos
build_macos_intel_38

00:15:19

0.0%
 
Name Stage Failure
failed
build_macos_intel_38 Build
Tests failed for bob.ip.facedetect-4.0.1b0-py38ha80a218_2.conda - moving package to /Users/gitlab/builds/nrU4yQP1/0/bob/bob.ip.facedetect/miniconda/conda-bld/broken
TESTS FAILED: bob.ip.facedetect-4.0.1b0-py38ha80a218_2.conda
Uploading artifacts for failed job
Uploading artifacts...
Runtime platform
arch=amd64 os=darwin pid=75420 revision=e0218c92 version=14.3.2
WARNING: coverage.xml: no matching files
ERROR: No files to upload
Cleaning up project directory and file based variables
ERROR: Job failed: exit status 1

failed
build_linux_38 Build
FAILED (errors=1)
Tests failed for bob.ip.facedetect-4.0.1b0-py38hd637d3b_1.conda - moving package to /scratch/builds/bob/bob.ip.facedetect/miniconda/conda-bld/broken
TESTS FAILED: bob.ip.facedetect-4.0.1b0-py38hd637d3b_1.conda
Uploading artifacts for failed job
Uploading artifacts...
WARNING: coverage.xml: no matching files
ERROR: No files to upload
Cleaning up project directory and file based variables
ERROR: Job failed: exit code 1