Sphinx 3 autodoc no longer accepts autodoc_default_flags and autodoc_default_options should be used

5 jobs for master in 5 minutes and 10 seconds (queued for 10 seconds)
Status Job ID Name Coverage
  Build
failed #216885
docker
build_linux_36

00:04:12

95.0%
failed #216886
docker
build_linux_37

00:04:18

95.0%
failed #216883
macosx
build_macosx_36

00:05:10

95.0%
failed #216884
macosx
build_macosx_37

00:05:09

95.0%
 
  Deploy
skipped #216887
docker
deploy_beta
 
Name Stage Failure
failed
build_macosx_36 Build
WARNING conda_build.build:tests_failed(2896): Tests failed for bob.io.video-3.0.4b0-py36h7d06d85_24.conda - moving package to /Users/gitlab/builds/b6d3167a/0/bob/bob.io.video/miniconda/conda-bld/broken
TESTS FAILED: bob.io.video-3.0.4b0-py36h7d06d85_24.conda
Uploading artifacts for failed job
Uploading artifacts...
Runtime platform
arch=amd64 os=darwin pid=25193 revision=ece86343 version=13.5.0
WARNING: coverage.xml: no matching files
ERROR: No files to upload
Cleaning up file based variables
ERROR: Job failed: exit status 1
failed
build_macosx_37 Build
WARNING conda_build.build:tests_failed(2896): Tests failed for bob.io.video-3.0.4b0-py37h7d06d85_22.conda - moving package to /Users/gitlab/builds/b6d3167a/1/bob/bob.io.video/miniconda/conda-bld/broken
TESTS FAILED: bob.io.video-3.0.4b0-py37h7d06d85_22.conda
Uploading artifacts for failed job
Uploading artifacts...
Runtime platform
arch=amd64 os=darwin pid=25164 revision=ece86343 version=13.5.0
WARNING: coverage.xml: no matching files
ERROR: No files to upload
Cleaning up file based variables
ERROR: Job failed: exit status 1
failed
build_linux_37 Build
Tests failed for bob.io.video-3.0.4b0-py37h76fb8f0_25.conda - moving package to /scratch/builds/bob/bob.io.video/miniconda/conda-bld/broken
WARNING conda_build.build:tests_failed(2896): Tests failed for bob.io.video-3.0.4b0-py37h76fb8f0_25.conda - moving package to /scratch/builds/bob/bob.io.video/miniconda/conda-bld/broken
TESTS FAILED: bob.io.video-3.0.4b0-py37h76fb8f0_25.conda
Uploading artifacts for failed job
Uploading artifacts...
WARNING: coverage.xml: no matching files
ERROR: No files to upload
Cleaning up file based variables
ERROR: Job failed: exit code 1
failed
build_linux_36 Build
Tests failed for bob.io.video-3.0.4b0-py36h76fb8f0_24.conda - moving package to /scratch/builds/bob/bob.io.video/miniconda/conda-bld/broken
WARNING conda_build.build:tests_failed(2896): Tests failed for bob.io.video-3.0.4b0-py36h76fb8f0_24.conda - moving package to /scratch/builds/bob/bob.io.video/miniconda/conda-bld/broken
TESTS FAILED: bob.io.video-3.0.4b0-py36h76fb8f0_24.conda
Uploading artifacts for failed job
Uploading artifacts...
WARNING: coverage.xml: no matching files
ERROR: No files to upload
Cleaning up file based variables
ERROR: Job failed: exit code 1