Merge branch '26-gif-loading-seems-to-be-completely-broken' of…

Merge branch '26-gif-loading-seems-to-be-completely-broken' of https://gitlab.idiap.ch/bob/bob.io.image into 26-gif-loading-seems-to-be-completely-broken
12 jobs from 26-gif-loading-seems-to-be-completely-broken in 30 minutes 1 second (queued for 7 minutes 9 seconds)
Status Job ID Name Coverage
  Build
passed #69473
conda-linux
build_linux_27

04:19

passed #69475
conda-linux
build_linux_35

07:25

passed #69477
conda-linux
build_linux_36

07:10

passed #69478
conda-macosx
build_macosx_27

03:24

passed #69476
conda-macosx
build_macosx_35

04:04

passed #69474
conda-macosx
build_macosx_36

03:40

 
  Test
failed #69483
conda-linux
test_linux_27

05:10

failed #69481
conda-linux
test_linux_35

04:37

failed #69479
conda-linux
test_linux_36

05:14

failed #69480
conda-macosx
test_macosx_27

01:27

failed #69482
conda-macosx
test_macosx_35

01:34

failed #69484
conda-macosx
test_macosx_36

01:37

 
Name Stage Failure
failed
test_linux_36 Test There is an unknown failure, please try again

----------------------------------------------------------------------
Ran 9 tests in 0.103s

FAILED (failures=1)
(18:24:36) Error: Command Failed "/home/gitlab-runner/builds/0d638152/0/bob/bob.io.image/build-prefix/bin/coverage run --source=bob.io.image /home/gitlab-runner/builds/0d638152/0/bob/bob.io.image/build-prefix/bin/nosetests -sv bob.io.image"
Running after script...
$ ./_ci/after_test.sh
ERROR: Job failed: exit status 1
failed
test_macosx_27 Test There is an unknown failure, please try again

----------------------------------------------------------------------
Ran 9 tests in 0.065s

FAILED (failures=1)
(18:33:30) Error: Command Failed "/Users/buildbot/work/gitlab-ci/f6f95b82/0/bob/bob.io.image/build-prefix/bin/coverage run --source=bob.io.image /Users/buildbot/work/gitlab-ci/f6f95b82/0/bob/bob.io.image/build-prefix/bin/nosetests -sv bob.io.image"
Running after script...
$ ./_ci/after_test.sh
ERROR: Job failed: exit status 1
failed
test_linux_35 Test There is an unknown failure, please try again

----------------------------------------------------------------------
Ran 9 tests in 0.096s

FAILED (failures=1)
(18:26:25) Error: Command Failed "/home/gitlab-runner/builds/0d638152/1/bob/bob.io.image/build-prefix/bin/coverage run --source=bob.io.image /home/gitlab-runner/builds/0d638152/1/bob/bob.io.image/build-prefix/bin/nosetests -sv bob.io.image"
Running after script...
$ ./_ci/after_test.sh
ERROR: Job failed: exit status 1
failed
test_macosx_35 Test There is an unknown failure, please try again

----------------------------------------------------------------------
Ran 9 tests in 0.126s

FAILED (failures=1)
(18:35:04) Error: Command Failed "/Users/buildbot/work/gitlab-ci/f6f95b82/0/bob/bob.io.image/build-prefix/bin/coverage run --source=bob.io.image /Users/buildbot/work/gitlab-ci/f6f95b82/0/bob/bob.io.image/build-prefix/bin/nosetests -sv bob.io.image"
Running after script...
$ ./_ci/after_test.sh
ERROR: Job failed: exit status 1
failed
test_linux_27 Test There is an unknown failure, please try again

----------------------------------------------------------------------
Ran 9 tests in 0.065s

FAILED (failures=1)
(18:29:36) Error: Command Failed "/home/gitlab-runner/builds/0d638152/2/bob/bob.io.image/build-prefix/bin/coverage run --source=bob.io.image /home/gitlab-runner/builds/0d638152/2/bob/bob.io.image/build-prefix/bin/nosetests -sv bob.io.image"
Running after script...
$ ./_ci/after_test.sh
ERROR: Job failed: exit status 1
failed
test_macosx_36 Test There is an unknown failure, please try again

----------------------------------------------------------------------
Ran 9 tests in 0.055s

FAILED (failures=1)
(18:35:41) Error: Command Failed "/Users/buildbot/work/gitlab-ci/f6f95b82/1/bob/bob.io.image/build-prefix/bin/coverage run --source=bob.io.image /Users/buildbot/work/gitlab-ci/f6f95b82/1/bob/bob.io.image/build-prefix/bin/nosetests -sv bob.io.image"
Running after script...
$ ./_ci/after_test.sh
ERROR: Job failed: exit status 1