Standardise

18 jobs for master in 12 minutes and 3 seconds (queued for 2 seconds)
Status Job ID Name Coverage
  Build
passed #5438
conda-linux
build_linux_27

00:00:30

passed #5439
conda-linux
build_linux_34

00:00:33

passed #5440
conda-linux
build_linux_35

00:00:33

passed #5394
conda-macosx
build_macosx_27

00:01:41

passed #5395
conda-macosx
build_macosx_34

00:01:56

passed #5396
conda-macosx
build_macosx_35

00:02:08

failed #5416
conda-linux
build_linux_27

00:00:24

failed #5391
conda-linux
build_linux_27

00:00:24

failed #5417
conda-linux
build_linux_34

00:00:27

failed #5392
conda-linux
build_linux_34

00:00:27

failed #5418
conda-linux
build_linux_35

00:00:27

failed #5393
conda-linux
build_linux_35

00:00:28

 
  Test
failed #5441
conda-linux
test_linux_27

00:00:17

failed #5442
conda-linux
test_linux_34

00:00:18

failed #5443
conda-linux
test_linux_35

00:00:18

failed #5444
conda-macosx
test_macosx_27

00:01:36

failed #5445
conda-macosx
test_macosx_34

00:01:15

failed #5446
conda-macosx
test_macosx_35

00:00:58

 
Name Stage Failure
failed
test_macosx_35 Test There is an unknown failure, please try again
Ran 3 tests in 0.125s

FAILED (errors=2)
Extracting url 'http://www.idiap.ch/software/bob/databases/latest/non_existing_db.tar.bz2' to '/var/folders/8n/phc2t7ln52l2srkgv49ybfj00001fc/T/tmpsxq3cazu/db.sql3'
Error while downloading: 'HTTP Error 404: Not Found'
Extracting url 'http://www.idiap.ch/software/bob/databases/latest/biowave_test.tar.bz2' to '/var/folders/8n/phc2t7ln52l2srkgv49ybfj00001fc/T/tmpsxq3cazu/db.sql3'
Running after script...
$ rm -rf ${CONDA_PREFIX}
ERROR: Build failed: exit status 1
failed
test_macosx_34 Test There is an unknown failure, please try again
Ran 3 tests in 0.122s

FAILED (errors=2)
Extracting url 'http://www.idiap.ch/software/bob/databases/latest/non_existing_db.tar.bz2' to '/var/folders/8n/phc2t7ln52l2srkgv49ybfj00001fc/T/tmpt_mbi52a/db.sql3'
Error while downloading: '<urlopen error [SSL: BAD_SIGNATURE] bad signature (_ssl.c:600)>'
Extracting url 'http://www.idiap.ch/software/bob/databases/latest/biowave_test.tar.bz2' to '/var/folders/8n/phc2t7ln52l2srkgv49ybfj00001fc/T/tmpt_mbi52a/db.sql3'
Running after script...
$ rm -rf ${CONDA_PREFIX}
ERROR: Build failed: exit status 1
failed
test_macosx_27 Test There is an unknown failure, please try again
----------------------------------------------------------------------
Ran 3 tests in 0.145s

FAILED (errors=2)
Extracting url 'http://www.idiap.ch/software/bob/databases/latest/non_existing_db.tar.bz2' to '/var/folders/8n/phc2t7ln52l2srkgv49ybfj00001fc/T/tmpD4Jnvc/db.sql3'
Error while downloading: 'HTTP Error 404: Not Found'
Extracting url 'http://www.idiap.ch/software/bob/databases/latest/biowave_test.tar.bz2' to '/var/folders/8n/phc2t7ln52l2srkgv49ybfj00001fc/T/tmpD4Jnvc/db.sql3'
Running after script...
$ rm -rf ${CONDA_PREFIX}
ERROR: Build failed:
failed
test_linux_35 Test There is an unknown failure, please try again
Ran 3 tests in 0.089s

FAILED (errors=2)
Extracting url 'http://www.idiap.ch/software/bob/databases/latest/non_existing_db.tar.bz2' to '/tmp/tmpcr64fqcx/db.sql3'
Error while downloading: '<urlopen error [SSL: BAD_SIGNATURE] bad signature (_ssl.c:645)>'
Extracting url 'http://www.idiap.ch/software/bob/databases/latest/biowave_test.tar.bz2' to '/tmp/tmpcr64fqcx/db.sql3'
Running after script...
$ rm -rf ${CONDA_PREFIX}
ERROR: Build failed: exit status 1
failed
test_linux_34 Test There is an unknown failure, please try again
Error while downloading: '<urlopen error [SSL: BAD_SIGNATURE] bad signature (_ssl.c:600)>'
Extracting url 'http://www.idiap.ch/software/bob/databases/latest/biowave_test.tar.bz2' to '/tmp/tmp7gk1lid8/db.sql3'
profiling:/local/gitlab-runner/builds/224a6381/0/bob/bob.blitz/build/temp.linux-x86_64-3.4/bob/blitz/version.gcda:Version mismatch - expected 504* got 406*
profiling:/local/gitlab-runner/builds/224a6381/0/bob/bob.blitz/build/temp.linux-x86_64-3.4/bob/blitz/main.gcda:Version mismatch - expected 504* got 406*
profiling:/local/gitlab-runner/builds/224a6381/0/bob/bob.blitz/build/temp.linux-x86_64-3.4/bob/blitz/array.gcda:Version mismatch - expected 504* got 406*
profiling:/local/gitlab-runner/builds/224a6381/0/bob/bob.blitz/build/temp.linux-x86_64-3.4/bob/blitz/api.gcda:Version mismatch - expected 504* got 406*
Running after script...
$ rm -rf ${CONDA_PREFIX}
ERROR: Build failed: exit status 1
failed
test_linux_27 Test There is an unknown failure, please try again
Ran 3 tests in 0.207s

FAILED (errors=2)
Extracting url 'http://www.idiap.ch/software/bob/databases/latest/non_existing_db.tar.bz2' to '/tmp/tmpUAk6Sc/db.sql3'
Error while downloading: 'HTTP Error 404: Not Found'
Extracting url 'http://www.idiap.ch/software/bob/databases/latest/biowave_test.tar.bz2' to '/tmp/tmpUAk6Sc/db.sql3'
Running after script...
$ rm -rf ${CONDA_PREFIX}
ERROR: Build failed: exit status 1