[conda] fix scikit-learn name

2 jobs for dask-pipelines in 4 minutes and 19 seconds (queued for 2 seconds)
Status Job ID Name Coverage
  Build
failed #218973
docker
build_linux_37

00:04:18

77.0%
failed #218972
macosx
build_macosx_37

00:03:58

77.0%
 
Name Stage Failure
failed
build_linux_37 Build
FAILED (errors=1)
Tests failed for bob.bio.video-3.4.7b0-py37ha70fdd4_23.conda - moving package to /scratch/builds/bob/bob.bio.video/miniconda/conda-bld/broken
TESTS FAILED: bob.bio.video-3.4.7b0-py37ha70fdd4_23.conda
Uploading artifacts for failed job
Uploading artifacts...
WARNING: coverage.xml: no matching files
ERROR: No files to upload
Cleaning up file based variables
ERROR: Job failed: exit code 1
failed
build_macosx_37 Build
Tests failed for bob.bio.video-3.4.7b0-py37h65735fe_21.conda - moving package to /Users/gitlab/builds/b6d3167a/0/bob/bob.bio.video/miniconda/conda-bld/broken
TESTS FAILED: bob.bio.video-3.4.7b0-py37h65735fe_21.conda
Uploading artifacts for failed job
Uploading artifacts...
Runtime platform
arch=amd64 os=darwin pid=53234 revision=ece86343 version=13.5.0
WARNING: coverage.xml: no matching files
ERROR: No files to upload
Cleaning up file based variables
ERROR: Job failed: exit status 1