[transfomer][wrapper] rename the wrapped instance to estimator since mario...

[transfomer][wrapper] rename the wrapped instance to estimator since mario expects that for better dask graphs
4 jobs for dask-pipelines in 9 minutes and 6 seconds (queued for 2 seconds)
Status Job ID Name Coverage
  Build
failed #213876
docker
build_linux_36

00:03:48

failed #213877
docker
build_linux_37

00:03:45

failed #213874
macosx
build_macosx_36

00:09:01

failed #213875
macosx
build_macosx_37

00:08:53

 
Name Stage Failure
failed
build_macosx_36 Build
WARNING conda_build.build:tests_failed(2890): Tests failed for bob.bio.video-3.4.7b0-py36h0442177_14.conda - moving package to /Users/gitlab/builds/f6f95b82/0/bob/bob.bio.video/miniconda/conda-bld/broken
TESTS FAILED: bob.bio.video-3.4.7b0-py36h0442177_14.conda
Uploading artifacts for failed job
Uploading artifacts...
Runtime platform
arch=amd64 os=darwin pid=32481 revision=e95f89a0 version=13.4.1
WARNING: coverage.xml: no matching files
ERROR: No files to upload
Cleaning up file based variables
ERROR: Job failed: exit status 1
failed
build_macosx_37 Build
WARNING conda_build.build:tests_failed(2890): Tests failed for bob.bio.video-3.4.7b0-py37h0442177_16.conda - moving package to /Users/gitlab/builds/f6f95b82/1/bob/bob.bio.video/miniconda/conda-bld/broken
TESTS FAILED: bob.bio.video-3.4.7b0-py37h0442177_16.conda
Uploading artifacts for failed job
Uploading artifacts...
Runtime platform
arch=amd64 os=darwin pid=32441 revision=e95f89a0 version=13.4.1
WARNING: coverage.xml: no matching files
ERROR: No files to upload
Cleaning up file based variables
ERROR: Job failed: exit status 1
failed
build_linux_36 Build
Tests failed for bob.bio.video-3.4.7b0-py36h0442177_17.conda - moving package to /scratch/builds/bob/bob.bio.video/miniconda/conda-bld/broken
WARNING conda_build.build:tests_failed(2890): Tests failed for bob.bio.video-3.4.7b0-py36h0442177_17.conda - moving package to /scratch/builds/bob/bob.bio.video/miniconda/conda-bld/broken
TESTS FAILED: bob.bio.video-3.4.7b0-py36h0442177_17.conda
Uploading artifacts for failed job
Uploading artifacts...
WARNING: coverage.xml: no matching files
ERROR: No files to upload
Cleaning up file based variables
ERROR: Job failed: exit code 1
failed
build_linux_37 Build
Tests failed for bob.bio.video-3.4.7b0-py37h0442177_17.conda - moving package to /scratch/builds/bob/bob.bio.video/miniconda/conda-bld/broken
WARNING conda_build.build:tests_failed(2890): Tests failed for bob.bio.video-3.4.7b0-py37h0442177_17.conda - moving package to /scratch/builds/bob/bob.bio.video/miniconda/conda-bld/broken
TESTS FAILED: bob.bio.video-3.4.7b0-py37h0442177_17.conda
Uploading artifacts for failed job
Uploading artifacts...
WARNING: coverage.xml: no matching files
ERROR: No files to upload
Cleaning up file based variables
ERROR: Job failed: exit code 1