playing around with test.py

12 jobs for btp in 12 minutes and 53 seconds (queued for 6 seconds)
Status Job ID Name Coverage
  Build
passed #50605
conda-linux
build_linux_27

00:02:58

passed #50607
conda-linux
build_linux_34

00:03:06

passed #50609
conda-linux
build_linux_35

00:03:06

passed #50610
conda-macosx
build_macosx_27

00:05:05

passed #50608
conda-macosx
build_macosx_34

00:05:03

passed #50606
conda-macosx
build_macosx_35

00:05:03

 
  Test
failed #50615
conda-linux
test_linux_27

00:02:42

failed #50613
conda-linux
test_linux_34

00:02:54

failed #50611
conda-linux
test_linux_35

00:02:57

failed #50612
conda-macosx
test_macosx_27

00:07:24

failed #50614
conda-macosx
test_macosx_34

00:07:40

failed #50616
conda-macosx
test_macosx_35

00:07:33

 
Name Stage Failure
failed
test_macosx_35 Test There is an unknown failure, please try again

----------------------------------------------------------------------
Ran 15 tests in 241.585s

FAILED (errors=1)
(12:54:58)
Error: Command Failed "/Users/buildbot/work/gitlab-ci/f6f95b82/2/bob/bob.bio.vein/build-prefix/bin/coverage run --source=bob.bio.vein /Users/buildbot/work/gitlab-ci/f6f95b82/2/bob/bob.bio.vein/build-prefix/bin/nosetests -sv bob.bio.vein"
Running after script...
$ ./_ci/after_test.sh
ERROR: Build failed: exit status 1
failed
test_linux_27 Test There is an unknown failure, please try again

----------------------------------------------------------------------
Ran 15 tests in 84.916s

FAILED (errors=1)
(12:45:27)
Error: Command Failed "/home/gitlab-runner/builds/0d638152/2/bob/bob.bio.vein/build-prefix/bin/coverage run --source=bob.bio.vein /home/gitlab-runner/builds/0d638152/2/bob/bob.bio.vein/build-prefix/bin/nosetests -sv bob.bio.vein"
Running after script...
$ ./_ci/after_test.sh
ERROR: Build failed: exit status 1
failed
test_macosx_34 Test There is an unknown failure, please try again

----------------------------------------------------------------------
Ran 15 tests in 243.183s

FAILED (errors=1)
(12:55:02)
Error: Command Failed "/Users/buildbot/work/gitlab-ci/f6f95b82/1/bob/bob.bio.vein/build-prefix/bin/coverage run --source=bob.bio.vein /Users/buildbot/work/gitlab-ci/f6f95b82/1/bob/bob.bio.vein/build-prefix/bin/nosetests -sv bob.bio.vein"
Running after script...
$ ./_ci/after_test.sh
ERROR: Build failed: exit status 1
failed
test_linux_34 Test There is an unknown failure, please try again

----------------------------------------------------------------------
Ran 15 tests in 95.008s

FAILED (errors=1)
(12:45:38)
Error: Command Failed "/home/gitlab-runner/builds/0d638152/1/bob/bob.bio.vein/build-prefix/bin/coverage run --source=bob.bio.vein /home/gitlab-runner/builds/0d638152/1/bob/bob.bio.vein/build-prefix/bin/nosetests -sv bob.bio.vein"
Running after script...
$ ./_ci/after_test.sh
ERROR: Build failed: exit status 1
failed
test_macosx_27 Test There is an unknown failure, please try again

----------------------------------------------------------------------
Ran 15 tests in 227.297s

FAILED (errors=1)
(12:54:46)
Error: Command Failed "/Users/buildbot/work/gitlab-ci/f6f95b82/0/bob/bob.bio.vein/build-prefix/bin/coverage run --source=bob.bio.vein /Users/buildbot/work/gitlab-ci/f6f95b82/0/bob/bob.bio.vein/build-prefix/bin/nosetests -sv bob.bio.vein"
Running after script...
$ ./_ci/after_test.sh
ERROR: Build failed: exit status 1
failed
test_linux_35 Test There is an unknown failure, please try again

----------------------------------------------------------------------
Ran 15 tests in 96.112s

FAILED (errors=1)
(12:45:39)
Error: Command Failed "/home/gitlab-runner/builds/0d638152/0/bob/bob.bio.vein/build-prefix/bin/coverage run --source=bob.bio.vein /home/gitlab-runner/builds/0d638152/0/bob/bob.bio.vein/build-prefix/bin/nosetests -sv bob.bio.vein"
Running after script...
$ ./_ci/after_test.sh
ERROR: Build failed: exit status 1