Merge branch 'deprecate-mlp' into 'master'

Remove WatershedMask since bob.learn.mlp is deprecated

See merge request !50
5 jobs for master in 11 minutes and 9 seconds (queued for 3 seconds)
Status Job ID Name Coverage
  Build
failed #235927
docker
build_linux_37

00:07:12

74.0%
failed #235928
docker
build_linux_38

00:06:52

74.0%
failed #235925
intel macos
build_macos_intel_37

00:11:09

74.0%
failed #235926
intel macos
build_macos_intel_38

00:11:01

74.0%
 
  Deploy
skipped #235929
docker
deploy_beta
 
Name Stage Failure
failed
build_macos_intel_37 Build
Tests failed for bob.bio.vein-2.0.1b0-py37h7a1313a_39.conda - moving package to /Users/gitlab/builds/nrU4yQP1/0/bob/bob.bio.vein/miniconda/conda-bld/broken
TESTS FAILED: bob.bio.vein-2.0.1b0-py37h7a1313a_39.conda
Uploading artifacts for failed job
Uploading artifacts...
Runtime platform
arch=amd64 os=darwin pid=88527 revision=3b6f852e version=14.0.0
WARNING: coverage.xml: no matching files
ERROR: No files to upload
Cleaning up file based variables
ERROR: Job failed: exit status 1
failed
build_macos_intel_38 Build
Tests failed for bob.bio.vein-2.0.1b0-py38h7a1313a_40.conda - moving package to /Users/gitlab/builds/nrU4yQP1/1/bob/bob.bio.vein/miniconda/conda-bld/broken
TESTS FAILED: bob.bio.vein-2.0.1b0-py38h7a1313a_40.conda
Uploading artifacts for failed job
Uploading artifacts...
Runtime platform
arch=amd64 os=darwin pid=88420 revision=3b6f852e version=14.0.0
WARNING: coverage.xml: no matching files
ERROR: No files to upload
Cleaning up file based variables
ERROR: Job failed: exit status 1
failed
build_linux_37 Build
/scratch/builds/bob/bob.bio.vein/doc/installation.rst:63:undefined label: bob.bio.base.installation (if the link has no caption the label must precede a section header)
Tests failed for bob.bio.vein-2.0.1b0-py37h1f2016e_45.conda - moving package to /scratch/builds/bob/bob.bio.vein/miniconda/conda-bld/broken
TESTS FAILED: bob.bio.vein-2.0.1b0-py37h1f2016e_45.conda
Uploading artifacts for failed job
Uploading artifacts...
WARNING: coverage.xml: no matching files
ERROR: No files to upload
Cleaning up file based variables
ERROR: Job failed: exit code 1
failed
build_linux_38 Build
/scratch/builds/bob/bob.bio.vein/doc/installation.rst:63:undefined label: bob.bio.base.installation (if the link has no caption the label must precede a section header)
Tests failed for bob.bio.vein-2.0.1b0-py38h1f2016e_42.conda - moving package to /scratch/builds/bob/bob.bio.vein/miniconda/conda-bld/broken
TESTS FAILED: bob.bio.vein-2.0.1b0-py38h1f2016e_42.conda
Uploading artifacts for failed job
Uploading artifacts...
WARNING: coverage.xml: no matching files
ERROR: No files to upload
Cleaning up file based variables
ERROR: Job failed: exit code 1