correct the default value of threshold for PC

4 jobs for PrincipalCurvature in 65 minutes and 2 seconds (queued for 2 seconds)
Status Job ID Name Coverage
  Build
failed #215012
docker
build_linux_36

00:07:16

72.0%
failed #215013
docker
build_linux_37

00:06:54

72.0%
failed #215010
macosx
build_macosx_36

01:04:54

72.0%
failed #215011
macosx
build_macosx_37

01:04:54

72.0%
 
Name Stage Failure
failed
build_macosx_37 Build
WARNING conda_build.build:tests_failed(2896): Tests failed for bob.bio.vein-1.1.7b0-py37hf0b74fa_21.conda - moving package to /Users/gitlab/builds/b6d3167a/1/bob/bob.bio.vein/miniconda/conda-bld/broken
TESTS FAILED: bob.bio.vein-1.1.7b0-py37hf0b74fa_21.conda
Uploading artifacts for failed job
Uploading artifacts...
Runtime platform
arch=amd64 os=darwin pid=45481 revision=ece86343 version=13.5.0
WARNING: coverage.xml: no matching files
ERROR: No files to upload
Cleaning up file based variables
ERROR: Job failed: exit status 1
failed
build_macosx_36 Build
WARNING conda_build.build:tests_failed(2896): Tests failed for bob.bio.vein-1.1.7b0-py36hf0b74fa_20.conda - moving package to /Users/gitlab/builds/b6d3167a/0/bob/bob.bio.vein/miniconda/conda-bld/broken
TESTS FAILED: bob.bio.vein-1.1.7b0-py36hf0b74fa_20.conda
Uploading artifacts for failed job
Uploading artifacts...
Runtime platform
arch=amd64 os=darwin pid=45466 revision=ece86343 version=13.5.0
WARNING: coverage.xml: no matching files
ERROR: No files to upload
Cleaning up file based variables
ERROR: Job failed: exit status 1
failed
build_linux_36 Build
Tests failed for bob.bio.vein-1.1.7b0-py36h4662d67_23.conda - moving package to /scratch/builds/bob/bob.bio.vein/miniconda/conda-bld/broken
WARNING conda_build.build:tests_failed(2896): Tests failed for bob.bio.vein-1.1.7b0-py36h4662d67_23.conda - moving package to /scratch/builds/bob/bob.bio.vein/miniconda/conda-bld/broken
TESTS FAILED: bob.bio.vein-1.1.7b0-py36h4662d67_23.conda
Uploading artifacts for failed job
Uploading artifacts...
WARNING: coverage.xml: no matching files
ERROR: No files to upload
Cleaning up file based variables
ERROR: Job failed: exit code 1
failed
build_linux_37 Build
Tests failed for bob.bio.vein-1.1.7b0-py37h4662d67_23.conda - moving package to /scratch/builds/bob/bob.bio.vein/miniconda/conda-bld/broken
WARNING conda_build.build:tests_failed(2896): Tests failed for bob.bio.vein-1.1.7b0-py37h4662d67_23.conda - moving package to /scratch/builds/bob/bob.bio.vein/miniconda/conda-bld/broken
TESTS FAILED: bob.bio.vein-1.1.7b0-py37h4662d67_23.conda
Uploading artifacts for failed job
Uploading artifacts...
WARNING: coverage.xml: no matching files
ERROR: No files to upload
Cleaning up file based variables
ERROR: Job failed: exit code 1