Applied the bob.bio.base rm -rf logs/

4 jobs for purpose in 42 minutes and 49 seconds (queued for 5 seconds)
latest
Status Job ID Name Coverage
  Build
failed #237628
docker
build_linux_37

00:42:49

68.0%
failed #237629
docker
build_linux_38

00:42:13

69.0%
failed #237626
intel macos
build_macos_intel_37

00:21:23

61.0%
failed #237627
intel macos
build_macos_intel_38

00:21:22

61.0%
 
Name Stage Failure
failed
build_linux_37 Build
===== 1 failed, 49 passed, 14 skipped, 903 warnings in 1662.11s (0:27:42) ======
Tests failed for bob.bio.face-5.0.1b0-py37h083fc0b_66.conda - moving package to /scratch/builds/bob/bob.bio.face/miniconda/conda-bld/broken
TESTS FAILED: bob.bio.face-5.0.1b0-py37h083fc0b_66.conda
Uploading artifacts for failed job
Uploading artifacts...
coverage.xml: found 1 matching files and directories

Uploading artifacts as "cobertura" to coordinator... ok
id=237628 responseStatus=201 Created token=FA_ZzUNe
Cleaning up file based variables
ERROR: Job failed: exit code 1
failed
build_linux_38 Build
===== 1 failed, 49 passed, 14 skipped, 903 warnings in 1620.29s (0:27:00) ======
Tests failed for bob.bio.face-5.0.1b0-py38h083fc0b_63.conda - moving package to /scratch/builds/bob/bob.bio.face/miniconda/conda-bld/broken
TESTS FAILED: bob.bio.face-5.0.1b0-py38h083fc0b_63.conda
Uploading artifacts for failed job
Uploading artifacts...
coverage.xml: found 1 matching files and directories

Uploading artifacts as "cobertura" to coordinator... ok
id=237629 responseStatus=201 Created token=ByX3YdRy
Cleaning up file based variables
ERROR: Job failed: exit code 1
failed
build_macos_intel_37 Build
Tests failed for bob.bio.face-5.0.1b0-py37h301c2a9_62.conda - moving package to /Users/gitlab/builds/nrU4yQP1/2/bob/bob.bio.face/miniconda/conda-bld/broken
TESTS FAILED: bob.bio.face-5.0.1b0-py37h301c2a9_62.conda
Uploading artifacts for failed job
Uploading artifacts...
Runtime platform
arch=amd64 os=darwin pid=99746 revision=c1edb478 version=14.0.1
coverage.xml: found 1 matching files and directories

Uploading artifacts as "cobertura" to coordinator... ok
id=237626 responseStatus=201 Created token=SzwWHkDh
Cleaning up file based variables
ERROR: Job failed: exit status 1
failed
build_macos_intel_38 Build
Tests failed for bob.bio.face-5.0.1b0-py38h301c2a9_59.conda - moving package to /Users/gitlab/builds/nrU4yQP1/3/bob/bob.bio.face/miniconda/conda-bld/broken
TESTS FAILED: bob.bio.face-5.0.1b0-py38h301c2a9_59.conda
Uploading artifacts for failed job
Uploading artifacts...
Runtime platform
arch=amd64 os=darwin pid=99724 revision=c1edb478 version=14.0.1
coverage.xml: found 1 matching files and directories

Uploading artifacts as "cobertura" to coordinator... ok
id=237627 responseStatus=201 Created token=YyeXo-H2
Cleaning up file based variables
ERROR: Job failed: exit status 1