Fix the range of pola thermal images

4 jobs for distributed-arcface in 178 minutes and 16 seconds (queued for 2 seconds)
Status Job ID Name Coverage
  Build
failed #235117
docker
build_linux_37

02:58:11

71.0%
failed #235118
docker
build_linux_38

02:56:02

71.0%
failed #235115
intel macos
build_macos_intel_37

02:21:49

63.0%
failed #235116
intel macos
build_macos_intel_38

02:18:49

64.0%
 
Name Stage Failure
failed
build_linux_37 Build
===== 1 failed, 49 passed, 14 skipped, 903 warnings in 10293.00s (2:51:33) =====
Tests failed for bob.bio.face-5.0.1b0-py37h083fc0b_50.conda - moving package to /scratch/builds/bob/bob.bio.face/miniconda/conda-bld/broken
TESTS FAILED: bob.bio.face-5.0.1b0-py37h083fc0b_50.conda
Uploading artifacts for failed job
Uploading artifacts...
coverage.xml: found 1 matching files and directories

Uploading artifacts as "cobertura" to coordinator... ok
id=235117 responseStatus=201 Created token=N8YVQ_Xx
Cleaning up file based variables
ERROR: Job failed: exit code 1
failed
build_linux_38 Build
===== 1 failed, 49 passed, 14 skipped, 903 warnings in 10172.19s (2:49:32) =====
Tests failed for bob.bio.face-5.0.1b0-py38h083fc0b_47.conda - moving package to /scratch/builds/bob/bob.bio.face/miniconda/conda-bld/broken
TESTS FAILED: bob.bio.face-5.0.1b0-py38h083fc0b_47.conda
Uploading artifacts for failed job
Uploading artifacts...
coverage.xml: found 1 matching files and directories

Uploading artifacts as "cobertura" to coordinator... ok
id=235118 responseStatus=201 Created token=xL7Ewq1Z
Cleaning up file based variables
ERROR: Job failed: exit code 1
failed
build_macos_intel_37 Build
Tests failed for bob.bio.face-5.0.1b0-py37h301c2a9_44.conda - moving package to /Users/gitlab/builds/nrU4yQP1/2/bob/bob.bio.face/miniconda/conda-bld/broken
TESTS FAILED: bob.bio.face-5.0.1b0-py37h301c2a9_44.conda
Uploading artifacts for failed job
Uploading artifacts...
Runtime platform
arch=amd64 os=darwin pid=50304 revision=7a6612da version=13.12.0
coverage.xml: found 1 matching files and directories

Uploading artifacts as "cobertura" to coordinator... ok
id=235115 responseStatus=201 Created token=942xo1wK
Cleaning up file based variables
ERROR: Job failed: exit status 1
failed
build_macos_intel_38 Build
Tests failed for bob.bio.face-5.0.1b0-py38h301c2a9_45.conda - moving package to /Users/gitlab/builds/nrU4yQP1/3/bob/bob.bio.face/miniconda/conda-bld/broken
TESTS FAILED: bob.bio.face-5.0.1b0-py38h301c2a9_45.conda
Uploading artifacts for failed job
Uploading artifacts...
Runtime platform
arch=amd64 os=darwin pid=49845 revision=7a6612da version=13.12.0
coverage.xml: found 1 matching files and directories

Uploading artifacts as "cobertura" to coordinator... ok
id=235116 responseStatus=201 Created token=ShKgDn1y
Cleaning up file based variables
ERROR: Job failed: exit status 1