Fixed the 'bob_data_folder' config key

4 jobs for vuln-csv in 8 minutes and 6 seconds
latest
Status Job ID Name Coverage
  Build
failed #229313
docker
build_linux_37

00:04:28

failed #229314
docker
build_linux_38

00:04:37

failed #229311
intel macos
build_macos_intel_37

00:08:06

failed #229312
intel macos
build_macos_intel_38

00:08:04

 
Name Stage Failure
failed
build_macos_intel_37 Build
Tests failed for bob.bio.face-5.0.1b0-py37h301c2a9_0.conda - moving package to /Users/gitlab/builds/nrU4yQP1/0/bob/bob.bio.face/miniconda/conda-bld/broken
TESTS FAILED: bob.bio.face-5.0.1b0-py37h301c2a9_0.conda
Uploading artifacts for failed job
Uploading artifacts...
Runtime platform
arch=amd64 os=darwin pid=15496 revision=54944146 version=13.10.0
WARNING: coverage.xml: no matching files
ERROR: No files to upload
Cleaning up file based variables
ERROR: Job failed: exit status 1
failed
build_macos_intel_38 Build
Tests failed for bob.bio.face-5.0.1b0-py38h301c2a9_0.conda - moving package to /Users/gitlab/builds/nrU4yQP1/1/bob/bob.bio.face/miniconda/conda-bld/broken
TESTS FAILED: bob.bio.face-5.0.1b0-py38h301c2a9_0.conda
Uploading artifacts for failed job
Uploading artifacts...
Runtime platform
arch=amd64 os=darwin pid=15477 revision=54944146 version=13.10.0
WARNING: coverage.xml: no matching files
ERROR: No files to upload
Cleaning up file based variables
ERROR: Job failed: exit status 1
failed
build_linux_38 Build
ModuleNotFoundError: No module named 'bob.pipelines.datasets.sample_loaders'; 'bob.pipelines.datasets' is not a package
Tests failed for bob.bio.face-5.0.1b0-py38h083fc0b_0.conda - moving package to /scratch/builds/bob/bob.bio.face/miniconda/conda-bld/broken
TESTS FAILED: bob.bio.face-5.0.1b0-py38h083fc0b_0.conda
Uploading artifacts for failed job
Uploading artifacts...
WARNING: coverage.xml: no matching files
ERROR: No files to upload
Cleaning up file based variables
ERROR: Job failed: exit code 1
failed
build_linux_37 Build
ModuleNotFoundError: No module named 'bob.pipelines.datasets.sample_loaders'; 'bob.pipelines.datasets' is not a package
Tests failed for bob.bio.face-5.0.1b0-py37h083fc0b_0.conda - moving package to /scratch/builds/bob/bob.bio.face/miniconda/conda-bld/broken
TESTS FAILED: bob.bio.face-5.0.1b0-py37h083fc0b_0.conda
Uploading artifacts for failed job
Uploading artifacts...
WARNING: coverage.xml: no matching files
ERROR: No files to upload
Cleaning up file based variables
ERROR: Job failed: exit code 1