Fixed the 'bob_data_folder' config key

4 jobs for vuln-csv in 37 minutes and 47 seconds (queued for 2 seconds)
Status Job ID Name Coverage
  Build
failed #225890
docker
build_linux_37

00:37:45

86.0%
failed #225891
docker
build_linux_38

00:36:56

86.0%
failed #225888
intel macos
build_macos_intel_37

00:12:24

84.0%
failed #225889
intel macos
build_macos_intel_38

00:12:17

84.0%
 
Name Stage Failure
failed
build_linux_37 Build
/scratch/builds/bob/bob.bio.face/miniconda/conda-bld/bob.bio.face_1615922023107/_test_env_placehold_placehold_placehold_placehold_placehold_placehold_placehold_placehold_placehold_placehold_placehold_placehold_placehold_placehold_placehold_placehold_pla/lib/python3.7/site-packages/bob/bio/face/database/__init__.py:docstring of bob.bio.face.database.ReplayMobileBioDatabase:10:Unknown interpreted text role "py:fct".
Tests failed for bob.bio.face-4.0.5b0-py37he7d6619_106.conda - moving package to /scratch/builds/bob/bob.bio.face/miniconda/conda-bld/broken
TESTS FAILED: bob.bio.face-4.0.5b0-py37he7d6619_106.conda
Uploading artifacts for failed job
Uploading artifacts...
WARNING: coverage.xml: no matching files
ERROR: No files to upload
Cleaning up file based variables
ERROR: Job failed: exit code 1
failed
build_linux_38 Build
/scratch/builds/bob/bob.bio.face/miniconda/conda-bld/bob.bio.face_1615922019445/_test_env_placehold_placehold_placehold_placehold_placehold_placehold_placehold_placehold_placehold_placehold_placehold_placehold_placehold_placehold_placehold_placehold_pla/lib/python3.8/site-packages/bob/bio/face/database/__init__.py:docstring of bob.bio.face.database.ReplayMobileBioDatabase:10:Unknown interpreted text role "py:fct".
Tests failed for bob.bio.face-4.0.5b0-py38he7d6619_37.conda - moving package to /scratch/builds/bob/bob.bio.face/miniconda/conda-bld/broken
TESTS FAILED: bob.bio.face-4.0.5b0-py38he7d6619_37.conda
Uploading artifacts for failed job
Uploading artifacts...
WARNING: coverage.xml: no matching files
ERROR: No files to upload
Cleaning up file based variables
ERROR: Job failed: exit code 1
failed
build_macos_intel_37 Build
Tests failed for bob.bio.face-4.0.5b0-py37hb7b1bbe_86.conda - moving package to /Users/gitlab/builds/nrU4yQP1/0/bob/bob.bio.face/miniconda/conda-bld/broken
TESTS FAILED: bob.bio.face-4.0.5b0-py37hb7b1bbe_86.conda
Uploading artifacts for failed job
Uploading artifacts...
Runtime platform
arch=amd64 os=darwin pid=7964 revision=2ebc4dc4 version=13.9.0
WARNING: coverage.xml: no matching files
ERROR: No files to upload
Cleaning up file based variables
ERROR: Job failed: exit status 1
failed
build_macos_intel_38 Build
Tests failed for bob.bio.face-4.0.5b0-py38hb7b1bbe_35.conda - moving package to /Users/gitlab/builds/nrU4yQP1/1/bob/bob.bio.face/miniconda/conda-bld/broken
TESTS FAILED: bob.bio.face-4.0.5b0-py38hb7b1bbe_35.conda
Uploading artifacts for failed job
Uploading artifacts...
Runtime platform
arch=amd64 os=darwin pid=7875 revision=2ebc4dc4 version=13.9.0
WARNING: coverage.xml: no matching files
ERROR: No files to upload
Cleaning up file based variables
ERROR: Job failed: exit status 1