Included two new baselines

4 jobs for tf-arcface in 23 minutes and 45 seconds (queued for 6 seconds)
Status Job ID Name Coverage
  Build
failed #223603
docker
build_linux_37

00:23:42

83.0%
failed #223604
docker
build_linux_38

00:23:41

83.0%
passed #223601
intel macos
build_macos_intel_37

00:12:10

81.0%
passed #223602
intel macos
build_macos_intel_38

00:12:10

82.0%
 
Name Stage Failure
failed
build_linux_37 Build
FAILED (SKIP=7, errors=16)
Tests failed for bob.bio.face-4.0.5b0-py37he7d6619_80.conda - moving package to /scratch/builds/bob/bob.bio.face/miniconda/conda-bld/broken
TESTS FAILED: bob.bio.face-4.0.5b0-py37he7d6619_80.conda
Uploading artifacts for failed job
Uploading artifacts...
WARNING: coverage.xml: no matching files
ERROR: No files to upload
Cleaning up file based variables
ERROR: Job failed: exit code 1
failed
build_linux_38 Build
FAILED (SKIP=7, errors=16)
Tests failed for bob.bio.face-4.0.5b0-py38he7d6619_10.conda - moving package to /scratch/builds/bob/bob.bio.face/miniconda/conda-bld/broken
TESTS FAILED: bob.bio.face-4.0.5b0-py38he7d6619_10.conda
Uploading artifacts for failed job
Uploading artifacts...
WARNING: coverage.xml: no matching files
ERROR: No files to upload
Cleaning up file based variables
ERROR: Job failed: exit code 1