Added the FaceXZoo face detector and face aligment model

5 jobs for pytorch-datasets in 18 minutes and 31 seconds (queued for 2 seconds)
Name Stage Failure
failed
build_macos_intel_39 Build
Tests failed for bob.bio.face-6.0.1b0-py39ha77b1cd_37.conda - moving package to /Users/gitlab/builds/sJWHRwoT/1/bob/bob.bio.face/miniconda/conda-bld/broken
TESTS FAILED: bob.bio.face-6.0.1b0-py39ha77b1cd_37.conda
Uploading artifacts for failed job
Uploading artifacts...
Runtime platform
arch=amd64 os=darwin pid=85443 revision=5316d4ac version=14.6.0
WARNING: coverage.xml: no matching files
ERROR: No files to upload
Cleaning up project directory and file based variables
ERROR: Job failed: exit status 1

failed
build_macos_intel_38 Build
Tests failed for bob.bio.face-6.0.1b0-py38ha77b1cd_42.conda - moving package to /Users/gitlab/builds/sJWHRwoT/0/bob/bob.bio.face/miniconda/conda-bld/broken
TESTS FAILED: bob.bio.face-6.0.1b0-py38ha77b1cd_42.conda
Uploading artifacts for failed job
Uploading artifacts...
Runtime platform
arch=amd64 os=darwin pid=85333 revision=5316d4ac version=14.6.0
WARNING: coverage.xml: no matching files
ERROR: No files to upload
Cleaning up project directory and file based variables
ERROR: Job failed: exit status 1

failed
build_linux_39 Build
ModuleNotFoundError: No module named 'cv2'
Tests failed for bob.bio.face-6.0.1b0-py39hc6584bb_45.conda - moving package to /scratch/builds/bob/bob.bio.face/miniconda/conda-bld/broken
TESTS FAILED: bob.bio.face-6.0.1b0-py39hc6584bb_45.conda
Uploading artifacts for failed job
Uploading artifacts...
WARNING: coverage.xml: no matching files
ERROR: No files to upload
Cleaning up project directory and file based variables
ERROR: Job failed: exit code 1

failed
build_linux_38 Build
ModuleNotFoundError: No module named 'cv2'
Tests failed for bob.bio.face-6.0.1b0-py38hc6584bb_49.conda - moving package to /scratch/builds/bob/bob.bio.face/miniconda/conda-bld/broken
TESTS FAILED: bob.bio.face-6.0.1b0-py38hc6584bb_49.conda
Uploading artifacts for failed job
Uploading artifacts...
WARNING: coverage.xml: no matching files
ERROR: No files to upload
Cleaning up project directory and file based variables
ERROR: Job failed: exit code 1

failed
build_macos_arm_39 Build
Tests failed for bob.bio.face-6.0.1b0-py39h09e559d_47.conda - moving package to /Users/gitlab/builds/sAZPGTqW/0/bob/bob.bio.face/miniconda/conda-bld/broken
TESTS FAILED: bob.bio.face-6.0.1b0-py39h09e559d_47.conda
Uploading artifacts for failed job
Uploading artifacts...
Runtime platform
arch=arm64 os=darwin pid=60303 revision=5316d4ac version=14.6.0
WARNING: coverage.xml: no matching files
ERROR: No files to upload
Cleaning up project directory and file based variables
ERROR: Job failed: exit status 1