Implemented the MOBIO pytorch dataset

5 jobs for pytorch-datasets in 19 minutes and 37 seconds (queued for 6 seconds)
Name Stage Failure
failed
build_macos_intel_38 Build
Tests failed for bob.bio.face-6.0.1b0-py38ha77b1cd_40.conda - moving package to /Users/gitlab/builds/sJWHRwoT/0/bob/bob.bio.face/miniconda/conda-bld/broken
TESTS FAILED: bob.bio.face-6.0.1b0-py38ha77b1cd_40.conda
Uploading artifacts for failed job
Uploading artifacts...
Runtime platform
arch=amd64 os=darwin pid=86715 revision=5316d4ac version=14.6.0
coverage.xml: found 1 matching files and directories

Uploading artifacts as "cobertura" to coordinator... ok
id=254414 responseStatus=201 Created token=JsvK65mZ
Cleaning up project directory and file based variables
ERROR: Job failed: exit status 1

failed
build_macos_intel_39 Build
Tests failed for bob.bio.face-6.0.1b0-py39ha77b1cd_35.conda - moving package to /Users/gitlab/builds/sJWHRwoT/1/bob/bob.bio.face/miniconda/conda-bld/broken
TESTS FAILED: bob.bio.face-6.0.1b0-py39ha77b1cd_35.conda
Uploading artifacts for failed job
Uploading artifacts...
Runtime platform
arch=amd64 os=darwin pid=86692 revision=5316d4ac version=14.6.0
coverage.xml: found 1 matching files and directories

Uploading artifacts as "cobertura" to coordinator... ok
id=254415 responseStatus=201 Created token=xg1xu9Jo
Cleaning up project directory and file based variables
ERROR: Job failed: exit status 1

failed
build_linux_39 Build
======================= 30 warnings, 2 errors in 11.42s ========================
Tests failed for bob.bio.face-6.0.1b0-py39hc6584bb_43.conda - moving package to /scratch/builds/bob/bob.bio.face/miniconda/conda-bld/broken
TESTS FAILED: bob.bio.face-6.0.1b0-py39hc6584bb_43.conda
Uploading artifacts for failed job
Uploading artifacts...
coverage.xml: found 1 matching files and directories

Uploading artifacts as "cobertura" to coordinator... ok
id=254418 responseStatus=201 Created token=tKdtVi8z
Cleaning up project directory and file based variables
ERROR: Job failed: exit code 1

failed
build_linux_38 Build
======================= 30 warnings, 2 errors in 10.82s ========================
Tests failed for bob.bio.face-6.0.1b0-py38hc6584bb_47.conda - moving package to /scratch/builds/bob/bob.bio.face/miniconda/conda-bld/broken
TESTS FAILED: bob.bio.face-6.0.1b0-py38hc6584bb_47.conda
Uploading artifacts for failed job
Uploading artifacts...
coverage.xml: found 1 matching files and directories

Uploading artifacts as "cobertura" to coordinator... ok
id=254417 responseStatus=201 Created token=-Gs7y9U8
Cleaning up project directory and file based variables
ERROR: Job failed: exit code 1

failed
build_macos_arm_39 Build
Tests failed for bob.bio.face-6.0.1b0-py39h09e559d_44.conda - moving package to /Users/gitlab/builds/sAZPGTqW/0/bob/bob.bio.face/miniconda/conda-bld/broken
TESTS FAILED: bob.bio.face-6.0.1b0-py39h09e559d_44.conda
Uploading artifacts for failed job
Uploading artifacts...
Runtime platform
arch=arm64 os=darwin pid=77196 revision=5316d4ac version=14.6.0
coverage.xml: found 1 matching files and directories

Uploading artifacts as "cobertura" to coordinator... ok
id=254416 responseStatus=201 Created token=s8vzUdNv
Cleaning up project directory and file based variables
ERROR: Job failed: exit status 1