Passing forward the labels for the LDA training

5 jobs for fix-167 in 22 minutes and 6 seconds (queued for 6 seconds)
Name Stage Failure
failed
build_linux_39 Build
====== 2 failed, 53 passed, 22 skipped, 875 warnings in 619.23s (0:10:19) ======
Tests failed for bob.bio.face-5.0.1b0-py39hc6584bb_0.conda - moving package to /scratch/builds/bob/bob.bio.face/miniconda/conda-bld/broken
TESTS FAILED: bob.bio.face-5.0.1b0-py39hc6584bb_0.conda
Uploading artifacts for failed job
Uploading artifacts...
coverage.xml: found 1 matching files and directories

Uploading artifacts as "cobertura" to coordinator... ok
id=251601 responseStatus=201 Created token=s3Lfc66C
Cleaning up project directory and file based variables
ERROR: Job failed: exit code 1

failed
build_linux_38 Build
====== 2 failed, 53 passed, 22 skipped, 875 warnings in 588.07s (0:09:48) ======
Tests failed for bob.bio.face-5.0.1b0-py38hc6584bb_0.conda - moving package to /scratch/builds/bob/bob.bio.face/miniconda/conda-bld/broken
TESTS FAILED: bob.bio.face-5.0.1b0-py38hc6584bb_0.conda
Uploading artifacts for failed job
Uploading artifacts...
coverage.xml: found 1 matching files and directories

Uploading artifacts as "cobertura" to coordinator... ok
id=251600 responseStatus=201 Created token=8f9iRtzJ
Cleaning up project directory and file based variables
ERROR: Job failed: exit code 1

failed
build_macos_intel_39 Build
Tests failed for bob.bio.face-5.0.1b0-py39ha77b1cd_0.conda - moving package to /Users/gitlab/builds/6eE8C-FW/1/bob/bob.bio.face/miniconda/conda-bld/broken
TESTS FAILED: bob.bio.face-5.0.1b0-py39ha77b1cd_0.conda
Uploading artifacts for failed job
Uploading artifacts...
Runtime platform
arch=amd64 os=darwin pid=9383 revision=f0a95a76 version=14.5.0
coverage.xml: found 1 matching files and directories

Uploading artifacts as "cobertura" to coordinator... ok
id=251598 responseStatus=201 Created token=y9_NBy7R
Cleaning up project directory and file based variables
ERROR: Job failed: exit status 1

failed
build_macos_intel_38 Build
Tests failed for bob.bio.face-5.0.1b0-py38ha77b1cd_0.conda - moving package to /Users/gitlab/builds/6eE8C-FW/0/bob/bob.bio.face/miniconda/conda-bld/broken
TESTS FAILED: bob.bio.face-5.0.1b0-py38ha77b1cd_0.conda
Uploading artifacts for failed job
Uploading artifacts...
Runtime platform
arch=amd64 os=darwin pid=9137 revision=f0a95a76 version=14.5.0
coverage.xml: found 1 matching files and directories

Uploading artifacts as "cobertura" to coordinator... ok
id=251597 responseStatus=201 Created token=wVZ7nDY_
Cleaning up project directory and file based variables
ERROR: Job failed: exit status 1

failed
build_macos_arm_39 Build
Tests failed for bob.bio.face-5.0.1b0-py39h09e559d_0.conda - moving package to /Users/gitlab/builds/sAZPGTqW/0/bob/bob.bio.face/miniconda/conda-bld/broken
TESTS FAILED: bob.bio.face-5.0.1b0-py39h09e559d_0.conda
Uploading artifacts for failed job
Uploading artifacts...
Runtime platform
arch=arm64 os=darwin pid=39155 revision=f0a95a76 version=14.5.0
coverage.xml: found 1 matching files and directories

Uploading artifacts as "cobertura" to coordinator... ok
id=251599 responseStatus=201 Created token=tZXbqNij
Cleaning up project directory and file based variables
ERROR: Job failed: exit status 1