Follow bob.bio.base convention : template_id -> reference_id

4 jobs for fix-ijbc in 181 minutes and 46 seconds (queued for 5 seconds)
Name Stage Failure
failed
build_linux_38 Build
===== 1 failed, 49 passed, 14 skipped, 903 warnings in 10422.36s (2:53:42) =====
Tests failed for bob.bio.face-5.0.1b0-py38h083fc0b_47.conda - moving package to /scratch/builds/bob/bob.bio.face/miniconda/conda-bld/broken
TESTS FAILED: bob.bio.face-5.0.1b0-py38h083fc0b_47.conda
Uploading artifacts for failed job
Uploading artifacts...
coverage.xml: found 1 matching files and directories

Uploading artifacts as "cobertura" to coordinator... ok
id=235122 responseStatus=201 Created token=KKeh5kzM
Cleaning up file based variables
ERROR: Job failed: exit code 1
failed
build_linux_37 Build
===== 1 failed, 49 passed, 14 skipped, 903 warnings in 10491.60s (2:54:51) =====
Tests failed for bob.bio.face-5.0.1b0-py37h083fc0b_50.conda - moving package to /scratch/builds/bob/bob.bio.face/miniconda/conda-bld/broken
TESTS FAILED: bob.bio.face-5.0.1b0-py37h083fc0b_50.conda
Uploading artifacts for failed job
Uploading artifacts...
coverage.xml: found 1 matching files and directories

Uploading artifacts as "cobertura" to coordinator... ok
id=235121 responseStatus=201 Created token=UW_ye4de
Cleaning up file based variables
ERROR: Job failed: exit code 1
failed
build_macos_intel_38 Build
Tests failed for bob.bio.face-5.0.1b0-py38h301c2a9_45.conda - moving package to /Users/gitlab/builds/nrU4yQP1/5/bob/bob.bio.face/miniconda/conda-bld/broken
TESTS FAILED: bob.bio.face-5.0.1b0-py38h301c2a9_45.conda
Uploading artifacts for failed job
Uploading artifacts...
Runtime platform
arch=amd64 os=darwin pid=55738 revision=7a6612da version=13.12.0
coverage.xml: found 1 matching files and directories

Uploading artifacts as "cobertura" to coordinator... ok
id=235120 responseStatus=201 Created token=2AaZJPvt
Cleaning up file based variables
ERROR: Job failed: exit status 1
failed
build_macos_intel_37 Build
Tests failed for bob.bio.face-5.0.1b0-py37h301c2a9_44.conda - moving package to /Users/gitlab/builds/nrU4yQP1/4/bob/bob.bio.face/miniconda/conda-bld/broken
TESTS FAILED: bob.bio.face-5.0.1b0-py37h301c2a9_44.conda
Uploading artifacts for failed job
Uploading artifacts...
Runtime platform
arch=amd64 os=darwin pid=56109 revision=7a6612da version=13.12.0
coverage.xml: found 1 matching files and directories

Uploading artifacts as "cobertura" to coordinator... ok
id=235119 responseStatus=201 Created token=vzXjsypk
Cleaning up file based variables
ERROR: Job failed: exit status 1