Follow bob.bio.base convention : template_id -> reference_id

4 jobs for fix-ijbc in 162 minutes and 37 seconds (queued for 4 seconds)
Status Name Job ID Coverage
  Build
failed build_linux_37 #234920
docker

02:42:35

71.0%
failed build_linux_38 #234921
docker

02:39:12

72.0%
failed build_macos_intel_37 #234918
macos intel

02:12:21

65.0%
failed build_macos_intel_38 #234919
macos intel

02:08:28

65.0%
 
Name Stage Failure
failed
build_linux_38 Build
====== 9 failed, 37 passed, 8 skipped, 873 warnings in 9175.09s (2:32:55) ======
Tests failed for bob.bio.face-5.0.1b0-py38h083fc0b_47.conda - moving package to /scratch/builds/bob/bob.bio.face/miniconda/conda-bld/broken
TESTS FAILED: bob.bio.face-5.0.1b0-py38h083fc0b_47.conda
Uploading artifacts for failed job
Uploading artifacts...
coverage.xml: found 1 matching files and directories

Uploading artifacts as "cobertura" to coordinator... ok
id=234921 responseStatus=201 Created token=XUvJ1McD
Cleaning up file based variables
ERROR: Job failed: exit code 1
failed
build_linux_37 Build
====== 9 failed, 37 passed, 8 skipped, 873 warnings in 9362.74s (2:36:02) ======
Tests failed for bob.bio.face-5.0.1b0-py37h083fc0b_50.conda - moving package to /scratch/builds/bob/bob.bio.face/miniconda/conda-bld/broken
TESTS FAILED: bob.bio.face-5.0.1b0-py37h083fc0b_50.conda
Uploading artifacts for failed job
Uploading artifacts...
coverage.xml: found 1 matching files and directories

Uploading artifacts as "cobertura" to coordinator... ok
id=234920 responseStatus=201 Created token=oQ_uP6zT
Cleaning up file based variables
ERROR: Job failed: exit code 1
failed
build_macos_intel_38 Build
Tests failed for bob.bio.face-5.0.1b0-py38h301c2a9_45.conda - moving package to /Users/gitlab/builds/nrU4yQP1/3/bob/bob.bio.face/miniconda/conda-bld/broken
TESTS FAILED: bob.bio.face-5.0.1b0-py38h301c2a9_45.conda
Uploading artifacts for failed job
Uploading artifacts...
Runtime platform
arch=amd64 os=darwin pid=63186 revision=7a6612da version=13.12.0
coverage.xml: found 1 matching files and directories

Uploading artifacts as "cobertura" to coordinator... ok
id=234919 responseStatus=201 Created token=t4LyU_k9
Cleaning up file based variables
ERROR: Job failed: exit status 1
failed
build_macos_intel_37 Build
Tests failed for bob.bio.face-5.0.1b0-py37h301c2a9_44.conda - moving package to /Users/gitlab/builds/nrU4yQP1/2/bob/bob.bio.face/miniconda/conda-bld/broken
TESTS FAILED: bob.bio.face-5.0.1b0-py37h301c2a9_44.conda
Uploading artifacts for failed job
Uploading artifacts...
Runtime platform
arch=amd64 os=darwin pid=68542 revision=7a6612da version=13.12.0
coverage.xml: found 1 matching files and directories

Uploading artifacts as "cobertura" to coordinator... ok
id=234918 responseStatus=201 Created token=SjsmiP-R
Cleaning up file based variables
ERROR: Job failed: exit status 1