[fix] Remove superfluous square brackets

5 jobs for master in 17 minutes and 54 seconds (queued for 1 second)
Status Name Job ID Coverage
  Build
failed build_linux_36 #217769
docker

00:07:03

80.0%
failed build_linux_37 #217770
docker

00:06:51

80.0%
failed build_macosx_36 #217767
macosx

00:17:54

80.0%
failed build_macosx_37 #217768
macosx

00:17:51

80.0%
 
  Deploy
skipped deploy_beta #217771
docker
 
Name Stage Failure
failed
build_linux_37 Build
Tests failed for bob.bio.face-4.0.5b0-py37hb9d309e_23.conda - moving package to /scratch/builds/bob/bob.bio.face/miniconda/conda-bld/broken
WARNING conda_build.build:tests_failed(2896): Tests failed for bob.bio.face-4.0.5b0-py37hb9d309e_23.conda - moving package to /scratch/builds/bob/bob.bio.face/miniconda/conda-bld/broken
TESTS FAILED: bob.bio.face-4.0.5b0-py37hb9d309e_23.conda
Uploading artifacts for failed job
Uploading artifacts...
WARNING: coverage.xml: no matching files
ERROR: No files to upload
Cleaning up file based variables
ERROR: Job failed: exit code 1
failed
build_linux_36 Build
Tests failed for bob.bio.face-4.0.5b0-py36hb9d309e_23.conda - moving package to /scratch/builds/bob/bob.bio.face/miniconda/conda-bld/broken
WARNING conda_build.build:tests_failed(2896): Tests failed for bob.bio.face-4.0.5b0-py36hb9d309e_23.conda - moving package to /scratch/builds/bob/bob.bio.face/miniconda/conda-bld/broken
TESTS FAILED: bob.bio.face-4.0.5b0-py36hb9d309e_23.conda
Uploading artifacts for failed job
Uploading artifacts...
WARNING: coverage.xml: no matching files
ERROR: No files to upload
Cleaning up file based variables
ERROR: Job failed: exit code 1
failed
build_macosx_37 Build
WARNING conda_build.build:tests_failed(2896): Tests failed for bob.bio.face-4.0.5b0-py37h8f407a2_21.conda - moving package to /Users/gitlab/builds/f6f95b82/1/bob/bob.bio.face/miniconda/conda-bld/broken
TESTS FAILED: bob.bio.face-4.0.5b0-py37h8f407a2_21.conda
Uploading artifacts for failed job
Uploading artifacts...
Runtime platform
arch=amd64 os=darwin pid=31222 revision=ece86343 version=13.5.0
WARNING: coverage.xml: no matching files
ERROR: No files to upload
Cleaning up file based variables
ERROR: Job failed: exit status 1
failed
build_macosx_36 Build
WARNING conda_build.build:tests_failed(2896): Tests failed for bob.bio.face-4.0.5b0-py36h8f407a2_21.conda - moving package to /Users/gitlab/builds/f6f95b82/0/bob/bob.bio.face/miniconda/conda-bld/broken
TESTS FAILED: bob.bio.face-4.0.5b0-py36h8f407a2_21.conda
Uploading artifacts for failed job
Uploading artifacts...
Runtime platform
arch=amd64 os=darwin pid=31238 revision=ece86343 version=13.5.0
WARNING: coverage.xml: no matching files
ERROR: No files to upload
Cleaning up file based variables
ERROR: Job failed: exit status 1