Implemented new MOBIO protocol

4 jobs for updates in 5 minutes and 20 seconds (queued for 2 seconds)
Name Stage Failure
failed
build_linux_36 Build
Tests failed for bob.bio.face-4.0.3b0-py36h27fbd2a_0.conda - moving package to /scratch/builds/bob/bob.bio.face/miniconda/conda-bld/broken
WARNING conda_build.build:tests_failed(2890): Tests failed for bob.bio.face-4.0.3b0-py36h27fbd2a_0.conda - moving package to /scratch/builds/bob/bob.bio.face/miniconda/conda-bld/broken
TESTS FAILED: bob.bio.face-4.0.3b0-py36h27fbd2a_0.conda
Uploading artifacts for failed job
Uploading artifacts...
WARNING: coverage.xml: no matching files
ERROR: No files to upload
Cleaning up file based variables
ERROR: Job failed: exit code 1
failed
build_macosx_36 Build
WARNING conda_build.build:tests_failed(2890): Tests failed for bob.bio.face-4.0.3b0-py36h27fbd2a_0.conda - moving package to /Users/gitlab/builds/b6d3167a/0/bob/bob.bio.face/miniconda/conda-bld/broken
TESTS FAILED: bob.bio.face-4.0.3b0-py36h27fbd2a_0.conda
Uploading artifacts for failed job
Uploading artifacts...
Runtime platform
arch=amd64 os=darwin pid=3822 revision=e95f89a0 version=13.4.1
WARNING: coverage.xml: no matching files
ERROR: No files to upload
Cleaning up file based variables
ERROR: Job failed: exit status 1
failed
build_macosx_37 Build
WARNING conda_build.build:tests_failed(2890): Tests failed for bob.bio.face-4.0.3b0-py37h27fbd2a_0.conda - moving package to /Users/gitlab/builds/b6d3167a/1/bob/bob.bio.face/miniconda/conda-bld/broken
TESTS FAILED: bob.bio.face-4.0.3b0-py37h27fbd2a_0.conda
Uploading artifacts for failed job
Uploading artifacts...
Runtime platform
arch=amd64 os=darwin pid=3775 revision=e95f89a0 version=13.4.1
WARNING: coverage.xml: no matching files
ERROR: No files to upload
Cleaning up file based variables
ERROR: Job failed: exit status 1
failed
build_linux_37 Build
Tests failed for bob.bio.face-4.0.3b0-py37h27fbd2a_0.conda - moving package to /scratch/builds/bob/bob.bio.face/miniconda/conda-bld/broken
WARNING conda_build.build:tests_failed(2890): Tests failed for bob.bio.face-4.0.3b0-py37h27fbd2a_0.conda - moving package to /scratch/builds/bob/bob.bio.face/miniconda/conda-bld/broken
TESTS FAILED: bob.bio.face-4.0.3b0-py37h27fbd2a_0.conda
Uploading artifacts for failed job
Uploading artifacts...
WARNING: coverage.xml: no matching files
ERROR: No files to upload
Cleaning up file based variables
ERROR: Job failed: exit code 1