Allowing facecrop helper to set the datatype

4 jobs for fix-gabor-graph in 5 minutes and 52 seconds (queued for 2 seconds)
Status Name Job ID Coverage
  Build
failed build_linux_36 #206996
docker

00:05:01

failed build_linux_37 #206997
docker

00:04:53

failed build_macosx_36 #206994
macosx

00:05:52

failed build_macosx_37 #206995
macosx

00:05:44

 
Name Stage Failure
failed
build_linux_37 Build
ModuleNotFoundError: No module named 'sklearn'
Tests failed for bob.bio.face-4.0.3b0-py37h27fbd2a_0.conda - moving package to /scratch/builds/bob/bob.bio.face/miniconda/conda-bld/broken
WARNING:conda_build.build:Tests failed for bob.bio.face-4.0.3b0-py37h27fbd2a_0.conda - moving package to /scratch/builds/bob/bob.bio.face/miniconda/conda-bld/broken
TESTS FAILED: bob.bio.face-4.0.3b0-py37h27fbd2a_0.conda
Uploading artifacts for failed job
Uploading artifacts...
WARNING: coverage.xml: no matching files
ERROR: No files to upload
ERROR: Job failed: exit code 1
failed
build_linux_36 Build
ModuleNotFoundError: No module named 'sklearn'
Tests failed for bob.bio.face-4.0.3b0-py36h27fbd2a_0.conda - moving package to /scratch/builds/bob/bob.bio.face/miniconda/conda-bld/broken
WARNING:conda_build.build:Tests failed for bob.bio.face-4.0.3b0-py36h27fbd2a_0.conda - moving package to /scratch/builds/bob/bob.bio.face/miniconda/conda-bld/broken
TESTS FAILED: bob.bio.face-4.0.3b0-py36h27fbd2a_0.conda
Uploading artifacts for failed job
Uploading artifacts...
WARNING: coverage.xml: no matching files
ERROR: No files to upload
ERROR: Job failed: exit code 1
failed
build_macosx_37 Build
Tests failed for bob.bio.face-4.0.3b0-py37h27fbd2a_0.conda - moving package to /Users/gitlab/builds/b6d3167a/1/bob/bob.bio.face/miniconda/conda-bld/broken
WARNING:conda_build.build:Tests failed for bob.bio.face-4.0.3b0-py37h27fbd2a_0.conda - moving package to /Users/gitlab/builds/b6d3167a/1/bob/bob.bio.face/miniconda/conda-bld/broken
TESTS FAILED: bob.bio.face-4.0.3b0-py37h27fbd2a_0.conda
Uploading artifacts for failed job
Uploading artifacts...
Runtime platform
arch=amd64 os=darwin pid=3784 revision=a998cacd version=13.2.2
WARNING: coverage.xml: no matching files
ERROR: No files to upload
ERROR: Job failed: exit status 1
failed
build_macosx_36 Build
Tests failed for bob.bio.face-4.0.3b0-py36h27fbd2a_0.conda - moving package to /Users/gitlab/builds/b6d3167a/0/bob/bob.bio.face/miniconda/conda-bld/broken
WARNING:conda_build.build:Tests failed for bob.bio.face-4.0.3b0-py36h27fbd2a_0.conda - moving package to /Users/gitlab/builds/b6d3167a/0/bob/bob.bio.face/miniconda/conda-bld/broken
TESTS FAILED: bob.bio.face-4.0.3b0-py36h27fbd2a_0.conda
Uploading artifacts for failed job
Uploading artifacts...
Runtime platform
arch=amd64 os=darwin pid=3824 revision=a998cacd version=13.2.2
WARNING: coverage.xml: no matching files
ERROR: No files to upload
ERROR: Job failed: exit status 1