[py][fix] Add annotation_type=None to atnt

4 jobs for dask-pipelines in 16 minutes and 15 seconds (queued for 2 seconds)
Name Stage Failure
failed
build_macosx_36 Build
Tests failed for bob.bio.face-4.0.3b0-py36h37df162_0.conda - moving package to /Users/gitlab/builds/f6f95b82/0/bob/bob.bio.face/miniconda/conda-bld/broken
WARNING:conda_build.build:Tests failed for bob.bio.face-4.0.3b0-py36h37df162_0.conda - moving package to /Users/gitlab/builds/f6f95b82/0/bob/bob.bio.face/miniconda/conda-bld/broken
TESTS FAILED: bob.bio.face-4.0.3b0-py36h37df162_0.conda
Uploading artifacts for failed job
Uploading artifacts...
Runtime platform
arch=amd64 os=darwin pid=67203 revision=a998cacd version=13.2.2
WARNING: coverage.xml: no matching files
ERROR: No files to upload
ERROR: Job failed: exit status 1
failed
build_linux_36 Build
ModuleNotFoundError: No module named 'sklearn'
Tests failed for bob.bio.face-4.0.3b0-py36h37df162_0.conda - moving package to /scratch/builds/bob/bob.bio.face/miniconda/conda-bld/broken
WARNING:conda_build.build:Tests failed for bob.bio.face-4.0.3b0-py36h37df162_0.conda - moving package to /scratch/builds/bob/bob.bio.face/miniconda/conda-bld/broken
TESTS FAILED: bob.bio.face-4.0.3b0-py36h37df162_0.conda
Uploading artifacts for failed job
Uploading artifacts...
WARNING: coverage.xml: no matching files
ERROR: No files to upload
ERROR: Job failed: exit code 1
failed
build_macosx_37 Build
Tests failed for bob.bio.face-4.0.3b0-py37h37df162_0.conda - moving package to /Users/gitlab/builds/f6f95b82/1/bob/bob.bio.face/miniconda/conda-bld/broken
WARNING:conda_build.build:Tests failed for bob.bio.face-4.0.3b0-py37h37df162_0.conda - moving package to /Users/gitlab/builds/f6f95b82/1/bob/bob.bio.face/miniconda/conda-bld/broken
TESTS FAILED: bob.bio.face-4.0.3b0-py37h37df162_0.conda
Uploading artifacts for failed job
Uploading artifacts...
Runtime platform
arch=amd64 os=darwin pid=67193 revision=a998cacd version=13.2.2
WARNING: coverage.xml: no matching files
ERROR: No files to upload
ERROR: Job failed: exit status 1
failed
build_linux_37 Build
ModuleNotFoundError: No module named 'sklearn'
Tests failed for bob.bio.face-4.0.3b0-py37h37df162_0.conda - moving package to /scratch/builds/bob/bob.bio.face/miniconda/conda-bld/broken
WARNING:conda_build.build:Tests failed for bob.bio.face-4.0.3b0-py37h37df162_0.conda - moving package to /scratch/builds/bob/bob.bio.face/miniconda/conda-bld/broken
TESTS FAILED: bob.bio.face-4.0.3b0-py37h37df162_0.conda
Uploading artifacts for failed job
Uploading artifacts...
WARNING: coverage.xml: no matching files
ERROR: No files to upload
ERROR: Job failed: exit code 1