Remove atnt config file since it is bob.bio.db

12 jobs for master in 38 minutes and 23 seconds (queued for 10 seconds)
Status Name Job ID Coverage
  Build
passed build_linux_27 #9735
conda-linux

00:00:48

passed build_linux_34 #9736
conda-linux

00:00:55

passed build_linux_35 #9737
conda-linux

00:00:56

passed build_macosx_27 #9738
conda-macosx

00:02:38

passed build_macosx_34 #9739
conda-macosx

00:13:35

passed build_macosx_35 #9740
conda-macosx

00:10:04

 
  Test
failed test_linux_27 #9753
conda-linux

00:00:44

failed test_linux_34 #9754
conda-linux

00:00:51

failed test_linux_35 #9755
conda-linux

00:00:51

failed test_macosx_27 #9756
conda-macosx

00:02:15

failed test_macosx_34 #9757
conda-macosx

00:02:24

failed test_macosx_35 #9758
conda-macosx

00:02:22

 
Name Stage Failure
failed
test_macosx_35 Test There is an unknown failure, please try again
profiling:invalid arc tag (0x3bbfde28)
profiling:invalid arc tag (0x00000045)
profiling:invalid arc tag (0x41747361)
profiling:invalid arc tag (0x00000004)
profiling:invalid arc tag (0x4b4e5a5f)
profiling:invalid object tag (0x696c6235)
Running after script...
$ rm -rf ${CONDA_PREFIX}
ERROR: Build failed: exit status 1
failed
test_macosx_34 Test There is an unknown failure, please try again
TypeError: model_ids() got an unexpected keyword argument 'protocol'

----------------------------------------------------------------------
Ran 26 tests in 60.515s

FAILED (SKIP=9, errors=1)
Running after script...
$ rm -rf ${CONDA_PREFIX}
ERROR: Build failed: exit status 1
failed
test_macosx_27 Test There is an unknown failure, please try again
profiling:invalid arc tag (0x00000547)
profiling:invalid arc tag (0x00000000)
profiling:invalid arc tag (0x6f6c6330)
profiling:invalid arc tag (0x43454545)
profiling:invalid arc tag (0x00000000)
profiling:invalid object tag (0x00000000)
Running after script...
$ rm -rf ${CONDA_PREFIX}
ERROR: Build failed: exit status 1
failed
test_linux_35 Test There is an unknown failure, please try again
TypeError: model_ids() got an unexpected keyword argument 'protocol'

----------------------------------------------------------------------
Ran 26 tests in 20.071s

FAILED (SKIP=10, errors=1)
Running after script...
$ rm -rf ${CONDA_PREFIX}
ERROR: Build failed: exit status 1
failed
test_linux_34 Test There is an unknown failure, please try again
TypeError: model_ids() got an unexpected keyword argument 'protocol'

----------------------------------------------------------------------
Ran 26 tests in 20.720s

FAILED (SKIP=10, errors=1)
Running after script...
$ rm -rf ${CONDA_PREFIX}
ERROR: Build failed: exit status 1
failed
test_linux_27 Test There is an unknown failure, please try again
TypeError: model_ids() got an unexpected keyword argument 'protocol'

----------------------------------------------------------------------
Ran 26 tests in 15.568s

FAILED (SKIP=10, errors=1)
Running after script...
$ rm -rf ${CONDA_PREFIX}
ERROR: Build failed: exit status 1