Update requirements.txt - remove gridtk

12 jobs for patch-1 in 24 minutes (queued for 5 seconds)
Status Job ID Name Coverage
  Build
passed #44297
conda-linux
build_linux_27

00:02:09

passed #44299
conda-linux
build_linux_34

00:01:23

passed #44301
conda-linux
build_linux_35

00:01:26

passed #44302
conda-macosx
build_macosx_27

00:05:40

passed #44300
conda-macosx
build_macosx_34

00:05:09

passed #44298
conda-macosx
build_macosx_35

00:05:44

 
  Test
failed #44307
conda-linux
test_linux_27

00:03:21

failed #44305
conda-linux
test_linux_34

00:03:21

failed #44303
conda-linux
test_linux_35

00:03:15

failed #44304
conda-macosx
test_macosx_27

00:06:02

failed #44306
conda-macosx
test_macosx_34

00:06:08

failed #44308
conda-macosx
test_macosx_35

00:06:21

 
Name Stage Failure
failed
test_macosx_35 Test There is an unknown failure, please try again

----------------------------------------------------------------------
Ran 45 tests in 185.670s

FAILED (failures=1)
(11:19:14)
Error: Command Failed "/Users/buildbot/work/gitlab-ci/f6f95b82/1/bob/bob.bio.base/build-prefix/bin/coverage run --source=bob.bio.base /Users/buildbot/work/gitlab-ci/f6f95b82/1/bob/bob.bio.base/build-prefix/bin/nosetests -sv bob.bio.base"
Running after script...
$ ./_ci/after_test.sh
ERROR: Build failed: exit status 1
failed
test_linux_27 Test There is an unknown failure, please try again

----------------------------------------------------------------------
Ran 45 tests in 106.746s

FAILED (failures=1)
(11:08:02)
Error: Command Failed "/home/gitlab-runner/builds/0d638152/2/bob/bob.bio.base/build-prefix/bin/coverage run --source=bob.bio.base /home/gitlab-runner/builds/0d638152/2/bob/bob.bio.base/build-prefix/bin/nosetests -sv bob.bio.base"
Running after script...
$ ./_ci/after_test.sh
ERROR: Build failed: exit status 1
failed
test_macosx_34 Test There is an unknown failure, please try again

----------------------------------------------------------------------
Ran 45 tests in 173.268s

FAILED (failures=1)
(11:18:15)
Error: Command Failed "/Users/buildbot/work/gitlab-ci/f6f95b82/0/bob/bob.bio.base/build-prefix/bin/coverage run --source=bob.bio.base /Users/buildbot/work/gitlab-ci/f6f95b82/0/bob/bob.bio.base/build-prefix/bin/nosetests -sv bob.bio.base"
Running after script...
$ ./_ci/after_test.sh
ERROR: Build failed: exit status 1
failed
test_linux_34 Test There is an unknown failure, please try again

----------------------------------------------------------------------
Ran 45 tests in 113.254s

FAILED (failures=1)
(11:08:00)
Error: Command Failed "/home/gitlab-runner/builds/0d638152/1/bob/bob.bio.base/build-prefix/bin/coverage run --source=bob.bio.base /home/gitlab-runner/builds/0d638152/1/bob/bob.bio.base/build-prefix/bin/nosetests -sv bob.bio.base"
Running after script...
$ ./_ci/after_test.sh
ERROR: Build failed: exit status 1
failed
test_macosx_27 Test There is an unknown failure, please try again

----------------------------------------------------------------------
Ran 45 tests in 171.539s

FAILED (failures=1)
(11:13:50)
Error: Command Failed "/Users/buildbot/work/gitlab-ci/f6f95b82/2/bob/bob.bio.base/build-prefix/bin/coverage run --source=bob.bio.base /Users/buildbot/work/gitlab-ci/f6f95b82/2/bob/bob.bio.base/build-prefix/bin/nosetests -sv bob.bio.base"
Running after script...
$ ./_ci/after_test.sh
ERROR: Build failed: exit status 1
failed
test_linux_35 Test There is an unknown failure, please try again

----------------------------------------------------------------------
Ran 45 tests in 110.794s

FAILED (failures=1)
(11:07:54)
Error: Command Failed "/home/gitlab-runner/builds/0d638152/0/bob/bob.bio.base/build-prefix/bin/coverage run --source=bob.bio.base /home/gitlab-runner/builds/0d638152/0/bob/bob.bio.base/build-prefix/bin/nosetests -sv bob.bio.base"
Running after script...
$ ./_ci/after_test.sh
ERROR: Build failed: exit status 1