Removed trash

4 jobs for bioalg in 13 minutes and 44 seconds (queued for 3 seconds)
Status Job ID Name Coverage
  Build
failed #242855
docker
build_linux_37

00:12:11

failed #242856
docker
build_linux_38

00:10:29

failed #242853
intel macos
build_macos_intel_37

00:13:44

failed #242854
intel macos
build_macos_intel_38

00:11:58

 
Name Stage Failure
failed
build_macos_intel_37 Build
ModuleNotFoundError: No module named 'bob.pipelines'
Tests failed for bob.bio.base-5.0.1b0-py37h2e0d83d_114.conda - moving package to /Users/gitlab/builds/nrU4yQP1/0/bob/bob.bio.base/miniconda/conda-bld/broken
TESTS FAILED: bob.bio.base-5.0.1b0-py37h2e0d83d_114.conda
Uploading artifacts for failed job
Uploading artifacts...
Runtime platform
arch=amd64 os=darwin pid=50263 revision=58ba2b95 version=14.2.0
WARNING: coverage.xml: no matching files
ERROR: No files to upload
Cleaning up file based variables
ERROR: Job failed: exit status 1
failed
build_linux_37 Build
    from bob.pipelines import DelayedSample, SampleSet
ModuleNotFoundError: No module named 'bob.pipelines'
Tests failed for bob.bio.base-5.0.1b0-py37h6f2479d_126.conda - moving package to /scratch/builds/bob/bob.bio.base/miniconda/conda-bld/broken
TESTS FAILED: bob.bio.base-5.0.1b0-py37h6f2479d_126.conda
Uploading artifacts for failed job
Uploading artifacts...
WARNING: coverage.xml: no matching files
ERROR: No files to upload
Cleaning up file based variables
ERROR: Job failed: exit code 1
failed
build_macos_intel_38 Build
ModuleNotFoundError: No module named 'bob.pipelines'
Tests failed for bob.bio.base-5.0.1b0-py38h2e0d83d_122.conda - moving package to /Users/gitlab/builds/nrU4yQP1/1/bob/bob.bio.base/miniconda/conda-bld/broken
TESTS FAILED: bob.bio.base-5.0.1b0-py38h2e0d83d_122.conda
Uploading artifacts for failed job
Uploading artifacts...
Runtime platform
arch=amd64 os=darwin pid=48421 revision=58ba2b95 version=14.2.0
WARNING: coverage.xml: no matching files
ERROR: No files to upload
Cleaning up file based variables
ERROR: Job failed: exit status 1
failed
build_linux_38 Build
    from bob.pipelines import DelayedSample, SampleSet
ModuleNotFoundError: No module named 'bob.pipelines'
Tests failed for bob.bio.base-5.0.1b0-py38h6f2479d_120.conda - moving package to /scratch/builds/bob/bob.bio.base/miniconda/conda-bld/broken
TESTS FAILED: bob.bio.base-5.0.1b0-py38h6f2479d_120.conda
Uploading artifacts for failed job
Uploading artifacts...
WARNING: coverage.xml: no matching files
ERROR: No files to upload
Cleaning up file based variables
ERROR: Job failed: exit code 1