Supporting the CSVWriter in our evaluation scripts

4 jobs for csvsupport in 12 minutes and 20 seconds
Status Job ID Name Coverage
  Build
failed #235330
docker
build_linux_37

00:06:28

84.0%
failed #235331
docker
build_linux_38

00:06:25

84.0%
failed #235328
intel macos
build_macos_intel_37

00:12:20

84.0%
failed #235329
intel macos
build_macos_intel_38

00:12:14

84.0%
 
Name Stage Failure
failed
build_macos_intel_37 Build
Tests failed for bob.bio.base-5.0.1b0-py37hededa9c_53.conda - moving package to /Users/gitlab/builds/nrU4yQP1/0/bob/bob.bio.base/miniconda/conda-bld/broken
TESTS FAILED: bob.bio.base-5.0.1b0-py37hededa9c_53.conda
Uploading artifacts for failed job
Uploading artifacts...
Runtime platform
arch=amd64 os=darwin pid=70888 revision=7a6612da version=13.12.0
WARNING: coverage.xml: no matching files
ERROR: No files to upload
Cleaning up file based variables
ERROR: Job failed: exit status 1
failed
build_macos_intel_38 Build
Tests failed for bob.bio.base-5.0.1b0-py38hededa9c_55.conda - moving package to /Users/gitlab/builds/nrU4yQP1/1/bob/bob.bio.base/miniconda/conda-bld/broken
TESTS FAILED: bob.bio.base-5.0.1b0-py38hededa9c_55.conda
Uploading artifacts for failed job
Uploading artifacts...
Runtime platform
arch=amd64 os=darwin pid=70794 revision=7a6612da version=13.12.0
WARNING: coverage.xml: no matching files
ERROR: No files to upload
Cleaning up file based variables
ERROR: Job failed: exit status 1
failed
build_linux_37 Build
/scratch/builds/bob/bob.bio.base/miniconda/conda-bld/bob.bio.base_1624009520451/_test_env_placehold_placehold_placehold_placehold_placehold_placehold_placehold_placehold_placehold_placehold_placehold_placehold_placehold_placehold_placehold_placehold_pla/lib/python3.7/site-packages/bob/bio/base/score/load.py:docstring of bob.bio.base.score.load.split_csv_writer:3:Unexpected indentation.
Tests failed for bob.bio.base-5.0.1b0-py37h625948f_60.conda - moving package to /scratch/builds/bob/bob.bio.base/miniconda/conda-bld/broken
TESTS FAILED: bob.bio.base-5.0.1b0-py37h625948f_60.conda
Uploading artifacts for failed job
Uploading artifacts...
WARNING: coverage.xml: no matching files
ERROR: No files to upload
Cleaning up file based variables
ERROR: Job failed: exit code 1
failed
build_linux_38 Build
/scratch/builds/bob/bob.bio.base/miniconda/conda-bld/bob.bio.base_1624009517675/_test_env_placehold_placehold_placehold_placehold_placehold_placehold_placehold_placehold_placehold_placehold_placehold_placehold_placehold_placehold_placehold_placehold_pla/lib/python3.8/site-packages/bob/bio/base/score/load.py:docstring of bob.bio.base.score.load.split_csv_writer:3:Unexpected indentation.
Tests failed for bob.bio.base-5.0.1b0-py38h625948f_55.conda - moving package to /scratch/builds/bob/bob.bio.base/miniconda/conda-bld/broken
TESTS FAILED: bob.bio.base-5.0.1b0-py38h625948f_55.conda
Uploading artifacts for failed job
Uploading artifacts...
WARNING: coverage.xml: no matching files
ERROR: No files to upload
Cleaning up file based variables
ERROR: Job failed: exit code 1