Fixes to wrapper API

4 jobs for wrapper-api2 in 4 minutes and 16 seconds (queued for 1 second)
latest
Status Job ID Name Coverage
  Build
failed #196843
docker
build_linux_36

00:04:07

80.0%
failed #196844
docker
build_linux_37

00:03:59

80.0%
failed #196841
macosx
build_macosx_36

00:04:16

80.0%
failed #196842
macosx
build_macosx_37

00:04:08

80.0%
 
Name Stage Failure
failed
build_macosx_36 Build
WARNING:conda_build.build:Tests failed for bob.bio.base-4.1.1b0-py36h326d8ff_49.conda - moving package to /Users/gitlab/builds/b6d3167a/0/bob/bob.bio.base/miniconda/conda-bld/broken
TESTS FAILED: bob.bio.base-4.1.1b0-py36h326d8ff_49.conda
Running after_script
Uploading artifacts for failed job
Uploading artifacts...
Runtime platform
arch=amd64 os=darwin pid=59322 revision=4c96e5ad version=12.9.0
WARNING: coverage.xml: no matching files
ERROR: No files to upload
ERROR: Job failed: exit status 1
failed
build_linux_36 Build
Tests failed for bob.bio.base-4.1.1b0-py36h326d8ff_50.conda - moving package to /scratch/builds/bob/bob.bio.base/miniconda/conda-bld/broken
WARNING:conda_build.build:Tests failed for bob.bio.base-4.1.1b0-py36h326d8ff_50.conda - moving package to /scratch/builds/bob/bob.bio.base/miniconda/conda-bld/broken
TESTS FAILED: bob.bio.base-4.1.1b0-py36h326d8ff_50.conda
Running after_script
Uploading artifacts for failed job
Uploading artifacts...
WARNING: coverage.xml: no matching files
ERROR: No files to upload
ERROR: Job failed: exit code 1
failed
build_macosx_37 Build
WARNING:conda_build.build:Tests failed for bob.bio.base-4.1.1b0-py37h326d8ff_47.conda - moving package to /Users/gitlab/builds/b6d3167a/1/bob/bob.bio.base/miniconda/conda-bld/broken
TESTS FAILED: bob.bio.base-4.1.1b0-py37h326d8ff_47.conda
Running after_script
Uploading artifacts for failed job
Uploading artifacts...
Runtime platform
arch=amd64 os=darwin pid=59289 revision=4c96e5ad version=12.9.0
WARNING: coverage.xml: no matching files
ERROR: No files to upload
ERROR: Job failed: exit status 1
failed
build_linux_37 Build
Tests failed for bob.bio.base-4.1.1b0-py37h326d8ff_47.conda - moving package to /scratch/builds/bob/bob.bio.base/miniconda/conda-bld/broken
WARNING:conda_build.build:Tests failed for bob.bio.base-4.1.1b0-py37h326d8ff_47.conda - moving package to /scratch/builds/bob/bob.bio.base/miniconda/conda-bld/broken
TESTS FAILED: bob.bio.base-4.1.1b0-py37h326d8ff_47.conda
Running after_script
Uploading artifacts for failed job
Uploading artifacts...
WARNING: coverage.xml: no matching files
ERROR: No files to upload
ERROR: Job failed: exit code 1