New processing API

New processing API
4 jobs for processing-API in 7 minutes and 50 seconds (queued for 4 seconds)
latest
Status Job ID Name Coverage
  Build
failed #190912
docker
build_linux_36

00:03:01

failed #190913
docker
build_linux_37

00:02:55

failed #190910
macosx
build_macosx_36

00:07:50

failed #190911
macosx
build_macosx_37

00:07:45

 
Name Stage Failure
failed
build_macosx_36 Build
    items = working_set.resolve(reqs, env, installer, extras=self.extras)
File "$PREFIX/lib/python3.6/site-packages/pkg_resources/__init__.py", line 786, in resolve
raise DistributionNotFound(req, requirers)
pkg_resources.DistributionNotFound: The 'dask-jobqueue' distribution was not found and is required by bob.pipelines

Tests failed for bob.bio.base-4.0.3b0-py36h03d05df_0.conda - moving package to /Users/gitlab/builds/f6f95b82/0/bob/bob.bio.base/miniconda/conda-bld/broken
WARNING:conda_build.build:Tests failed for bob.bio.base-4.0.3b0-py36h03d05df_0.conda - moving package to /Users/gitlab/builds/f6f95b82/0/bob/bob.bio.base/miniconda/conda-bld/broken
TESTS FAILED: bob.bio.base-4.0.3b0-py36h03d05df_0.conda
ERROR: Job failed: exit status 1
failed
build_macosx_37 Build
    items = working_set.resolve(reqs, env, installer, extras=self.extras)
File "$PREFIX/lib/python3.7/site-packages/pkg_resources/__init__.py", line 786, in resolve
raise DistributionNotFound(req, requirers)
pkg_resources.DistributionNotFound: The 'dask-jobqueue' distribution was not found and is required by bob.pipelines

Tests failed for bob.bio.base-4.0.3b0-py37h03d05df_0.conda - moving package to /Users/gitlab/builds/f6f95b82/1/bob/bob.bio.base/miniconda/conda-bld/broken
WARNING:conda_build.build:Tests failed for bob.bio.base-4.0.3b0-py37h03d05df_0.conda - moving package to /Users/gitlab/builds/f6f95b82/1/bob/bob.bio.base/miniconda/conda-bld/broken
TESTS FAILED: bob.bio.base-4.0.3b0-py37h03d05df_0.conda
ERROR: Job failed: exit status 1
failed
build_linux_36 Build
    items = working_set.resolve(reqs, env, installer, extras=self.extras)
File "$PREFIX/lib/python3.6/site-packages/pkg_resources/__init__.py", line 786, in resolve
raise DistributionNotFound(req, requirers)
pkg_resources.DistributionNotFound: The 'dask-jobqueue' distribution was not found and is required by bob.pipelines

Tests failed for bob.bio.base-4.0.3b0-py36h03d05df_0.conda - moving package to /scratch/builds/bob/bob.bio.base/miniconda/conda-bld/broken
WARNING:conda_build.build:Tests failed for bob.bio.base-4.0.3b0-py36h03d05df_0.conda - moving package to /scratch/builds/bob/bob.bio.base/miniconda/conda-bld/broken
TESTS FAILED: bob.bio.base-4.0.3b0-py36h03d05df_0.conda
ERROR: Job failed: exit code 1
failed
build_linux_37 Build
    items = working_set.resolve(reqs, env, installer, extras=self.extras)
File "$PREFIX/lib/python3.7/site-packages/pkg_resources/__init__.py", line 786, in resolve
raise DistributionNotFound(req, requirers)
pkg_resources.DistributionNotFound: The 'dask-jobqueue' distribution was not found and is required by bob.pipelines

Tests failed for bob.bio.base-4.0.3b0-py37h03d05df_0.conda - moving package to /scratch/builds/bob/bob.bio.base/miniconda/conda-bld/broken
WARNING:conda_build.build:Tests failed for bob.bio.base-4.0.3b0-py37h03d05df_0.conda - moving package to /scratch/builds/bob/bob.bio.base/miniconda/conda-bld/broken
TESTS FAILED: bob.bio.base-4.0.3b0-py37h03d05df_0.conda
ERROR: Job failed: exit code 1